{"text_format":"1","workbook":"xlsx","n_sheets":17,"sheets":["Cerramiento","Datos necesarios","Resultados","Materiales","Desp. Materiales","Auxiliar","Recop. Datos","Tabla3","Tabla3V","Tabla4","Tabla4V","Tabla5","Tabla5V","Tabla7","Tabla7V","Tabla9","Tabla9V"],"not_rendered":{"charts":3,"images":2,"macros":1,"external_links":0,"defined_names":28,"comments":1,"pivot_tables":0},"unopened":[],"bounds":{"document_bytes":16777216,"sheet_cells":100000,"rows_first":2000,"rows_last":500,"rows_between":2000,"halvings":0,"cell_chars":16384,"cell_head_chars":4096},"cells_cut":0,"cells_raw":0,"read":"whole","date_system":"1900"}

{"sheet":"Cerramiento","index":0,"n_rows":58,"n_cols":8,"rows_kept":58,"cut":false,"hidden":false,"merged":[[34,2,34,7],[2,2,3,2],[7,2,7,7],[2,3,3,3],[2,4,3,5],[2,6,3,7]]}
[]
[]
[null,null,"Tipo de cerramiento",null,"Datos necesarios"]
[]
[]
[]
[]
[null,null,"Solución de Proyecto"]
[null,null,"Grupo de material","Material","Espesor\n(m)","Espesor de cálculo\n(m)","Conductividad térmica\n(W/mK)","Resistencia térmica\n(m²K/W)"]
[null,null,null,null,null,{"$f":"IF((IFERROR((IF((VLOOKUP(Tabla1[[#This Row],[Material]],T_BaseDatos[[Material]:[Factor de resistencia a la\ndifusión del vapor de agua]],2,FALSE))=0,Tabla1[[#This Row],[Espesor\n(m)]],(VLOOKUP(Tabla1[[#This Row],[Material]],T_BaseDatos[[Material]:[Factor de resistencia a la\ndifusión del vapor de agua]],2,FALSE)))),\"\"))=0,\"\",(IFERROR((IF((VLOOKUP(Tabla1[[#This Row],[Material]],T_BaseDatos[[Material]:[Factor de resistencia a la\ndifusión del vapor de agua]],2,FALSE))=0,Tabla1[[#This Row],[Espesor\n(m)]],(VLOOKUP(Tabla1[[#This Row],[Material]],T_BaseDatos[[Material]:[Factor de resistencia a la\ndifusión del vapor de agua]],2,FALSE)))),\"\")))","v":""},{"$f":"IF((IFERROR((VLOOKUP(Tabla1[[#This Row],[Material]],T_BaseDatos[[Material]:[Factor de resistencia a la\ndifusión del vapor de agua]],3,FALSE)),\"\"))=0,\"\",(IFERROR((VLOOKUP(Tabla1[[#This Row],[Material]],T_BaseDatos[[Material]:[Factor de resistencia a la\ndifusión del vapor de agua]],3,FALSE)),\"\")))","v":""},{"$f":"IF((IFERROR((IF((VLOOKUP(Tabla1[[#This Row],[Material]],T_BaseDatos[[Material]:[Factor de resistencia a la\ndifusión del vapor de agua]],4,FALSE))=0,(Tabla1[[#This Row],[Espesor de cálculo\n(m)]]/Tabla1[[#This Row],[Conductividad térmica\n(W/mK)]]),(VLOOKUP(Tabla1[[#This Row],[Material]],T_BaseDatos[[Material]:[Factor de resistencia a la\ndifusión del vapor de agua]],4,FALSE)))),\"\"))=0,\"\",(IFERROR((IF((VLOOKUP(Tabla1[[#This Row],[Material]],T_BaseDatos[[Material]:[Factor de resistencia a la\ndifusión del vapor de agua]],4,FALSE))=0,(Tabla1[[#This Row],[Espesor de cálculo\n(m)]]/Tabla1[[#This Row],[Conductividad térmica\n(W/mK)]]),(VLOOKUP(Tabla1[[#This Row],[Material]],T_BaseDatos[[Material]:[Factor de resistencia a la\ndifusión del vapor de agua]],4,FALSE)))),\"\")))","v":""}]
[null,null,null,null,null,{"$f":"IF((IFERROR((IF((VLOOKUP(Tabla1[[#This Row],[Material]],T_BaseDatos[[Material]:[Factor de resistencia a la\ndifusión del vapor de agua]],2,FALSE))=0,Tabla1[[#This Row],[Espesor\n(m)]],(VLOOKUP(Tabla1[[#This Row],[Material]],T_BaseDatos[[Material]:[Factor de resistencia a la\ndifusión del vapor de agua]],2,FALSE)))),\"\"))=0,\"\",(IFERROR((IF((VLOOKUP(Tabla1[[#This Row],[Material]],T_BaseDatos[[Material]:[Factor de resistencia a la\ndifusión del vapor de agua]],2,FALSE))=0,Tabla1[[#This Row],[Espesor\n(m)]],(VLOOKUP(Tabla1[[#This Row],[Material]],T_BaseDatos[[Material]:[Factor de resistencia a la\ndifusión del vapor de agua]],2,FALSE)))),\"\")))","v":""},{"$f":"IF((IFERROR((VLOOKUP(Tabla1[[#This Row],[Material]],T_BaseDatos[[Material]:[Factor de resistencia a la\ndifusión del vapor de agua]],3,FALSE)),\"\"))=0,\"\",(IFERROR((VLOOKUP(Tabla1[[#This Row],[Material]],T_BaseDatos[[Material]:[Factor de resistencia a la\ndifusión del vapor de agua]],3,FALSE)),\"\")))","v":""},{"$f":"IF((IFERROR((IF((VLOOKUP(Tabla1[[#This Row],[Material]],T_BaseDatos[[Material]:[Factor de resistencia a la\ndifusión del vapor de agua]],4,FALSE))=0,(Tabla1[[#This Row],[Espesor de cálculo\n(m)]]/Tabla1[[#This Row],[Conductividad térmica\n(W/mK)]]),(VLOOKUP(Tabla1[[#This Row],[Material]],T_BaseDatos[[Material]:[Factor de resistencia a la\ndifusión del vapor de agua]],4,FALSE)))),\"\"))=0,\"\",(IFERROR((IF((VLOOKUP(Tabla1[[#This Row],[Material]],T_BaseDatos[[Material]:[Factor de resistencia a la\ndifusión del vapor de agua]],4,FALSE))=0,(Tabla1[[#This Row],[Espesor de cálculo\n(m)]]/Tabla1[[#This Row],[Conductividad térmica\n(W/mK)]]),(VLOOKUP(Tabla1[[#This Row],[Material]],T_BaseDatos[[Material]:[Factor de resistencia a la\ndifusión del vapor de agua]],4,FALSE)))),\"\")))","v":""}]
[null,null,null,null,null,{"$f":"IF((IFERROR((IF((VLOOKUP(Tabla1[[#This Row],[Material]],T_BaseDatos[[Material]:[Factor de resistencia a la\ndifusión del vapor de agua]],2,FALSE))=0,Tabla1[[#This Row],[Espesor\n(m)]],(VLOOKUP(Tabla1[[#This Row],[Material]],T_BaseDatos[[Material]:[Factor de resistencia a la\ndifusión del vapor de agua]],2,FALSE)))),\"\"))=0,\"\",(IFERROR((IF((VLOOKUP(Tabla1[[#This Row],[Material]],T_BaseDatos[[Material]:[Factor de resistencia a la\ndifusión del vapor de agua]],2,FALSE))=0,Tabla1[[#This Row],[Espesor\n(m)]],(VLOOKUP(Tabla1[[#This Row],[Material]],T_BaseDatos[[Material]:[Factor de resistencia a la\ndifusión del vapor de agua]],2,FALSE)))),\"\")))","v":""},{"$f":"IF((IFERROR((VLOOKUP(Tabla1[[#This Row],[Material]],T_BaseDatos[[Material]:[Factor de resistencia a la\ndifusión del vapor de agua]],3,FALSE)),\"\"))=0,\"\",(IFERROR((VLOOKUP(Tabla1[[#This Row],[Material]],T_BaseDatos[[Material]:[Factor de resistencia a la\ndifusión del vapor de agua]],3,FALSE)),\"\")))","v":""},{"$f":"IF((IFERROR((IF((VLOOKUP(Tabla1[[#This Row],[Material]],T_BaseDatos[[Material]:[Factor de resistencia a la\ndifusión del vapor de agua]],4,FALSE))=0,(Tabla1[[#This Row],[Espesor de cálculo\n(m)]]/Tabla1[[#This Row],[Conductividad térmica\n(W/mK)]]),(VLOOKUP(Tabla1[[#This Row],[Material]],T_BaseDatos[[Material]:[Factor de resistencia a la\ndifusión del vapor de agua]],4,FALSE)))),\"\"))=0,\"\",(IFERROR((IF((VLOOKUP(Tabla1[[#This Row],[Material]],T_BaseDatos[[Material]:[Factor de resistencia a la\ndifusión del vapor de agua]],4,FALSE))=0,(Tabla1[[#This Row],[Espesor de cálculo\n(m)]]/Tabla1[[#This Row],[Conductividad térmica\n(W/mK)]]),(VLOOKUP(Tabla1[[#This Row],[Material]],T_BaseDatos[[Material]:[Factor de resistencia a la\ndifusión del vapor de agua]],4,FALSE)))),\"\")))","v":""}]
[null,null,null,null,null,{"$f":"IF((IFERROR((IF((VLOOKUP(Tabla1[[#This Row],[Material]],T_BaseDatos[[Material]:[Factor de resistencia a la\ndifusión del vapor de agua]],2,FALSE))=0,Tabla1[[#This Row],[Espesor\n(m)]],(VLOOKUP(Tabla1[[#This Row],[Material]],T_BaseDatos[[Material]:[Factor de resistencia a la\ndifusión del vapor de agua]],2,FALSE)))),\"\"))=0,\"\",(IFERROR((IF((VLOOKUP(Tabla1[[#This Row],[Material]],T_BaseDatos[[Material]:[Factor de resistencia a la\ndifusión del vapor de agua]],2,FALSE))=0,Tabla1[[#This Row],[Espesor\n(m)]],(VLOOKUP(Tabla1[[#This Row],[Material]],T_BaseDatos[[Material]:[Factor de resistencia a la\ndifusión del vapor de agua]],2,FALSE)))),\"\")))","v":""},{"$f":"IF((IFERROR((VLOOKUP(Tabla1[[#This Row],[Material]],T_BaseDatos[[Material]:[Factor de resistencia a la\ndifusión del vapor de agua]],3,FALSE)),\"\"))=0,\"\",(IFERROR((VLOOKUP(Tabla1[[#This Row],[Material]],T_BaseDatos[[Material]:[Factor de resistencia a la\ndifusión del vapor de agua]],3,FALSE)),\"\")))","v":""},{"$f":"IF((IFERROR((IF((VLOOKUP(Tabla1[[#This Row],[Material]],T_BaseDatos[[Material]:[Factor de resistencia a la\ndifusión del vapor de agua]],4,FALSE))=0,(Tabla1[[#This Row],[Espesor de cálculo\n(m)]]/Tabla1[[#This Row],[Conductividad térmica\n(W/mK)]]),(VLOOKUP(Tabla1[[#This Row],[Material]],T_BaseDatos[[Material]:[Factor de resistencia a la\ndifusión del vapor de agua]],4,FALSE)))),\"\"))=0,\"\",(IFERROR((IF((VLOOKUP(Tabla1[[#This Row],[Material]],T_BaseDatos[[Material]:[Factor de resistencia a la\ndifusión del vapor de agua]],4,FALSE))=0,(Tabla1[[#This Row],[Espesor de cálculo\n(m)]]/Tabla1[[#This Row],[Conductividad térmica\n(W/mK)]]),(VLOOKUP(Tabla1[[#This Row],[Material]],T_BaseDatos[[Material]:[Factor de resistencia a la\ndifusión del vapor de agua]],4,FALSE)))),\"\")))","v":""}]
[null,null,null,null,null,{"$f":"IF((IFERROR((IF((VLOOKUP(Tabla1[[#This Row],[Material]],T_BaseDatos[[Material]:[Factor de resistencia a la\ndifusión del vapor de agua]],2,FALSE))=0,Tabla1[[#This Row],[Espesor\n(m)]],(VLOOKUP(Tabla1[[#This Row],[Material]],T_BaseDatos[[Material]:[Factor de resistencia a la\ndifusión del vapor de agua]],2,FALSE)))),\"\"))=0,\"\",(IFERROR((IF((VLOOKUP(Tabla1[[#This Row],[Material]],T_BaseDatos[[Material]:[Factor de resistencia a la\ndifusión del vapor de agua]],2,FALSE))=0,Tabla1[[#This Row],[Espesor\n(m)]],(VLOOKUP(Tabla1[[#This Row],[Material]],T_BaseDatos[[Material]:[Factor de resistencia a la\ndifusión del vapor de agua]],2,FALSE)))),\"\")))","v":""},{"$f":"IF((IFERROR((VLOOKUP(Tabla1[[#This Row],[Material]],T_BaseDatos[[Material]:[Factor de resistencia a la\ndifusión del vapor de agua]],3,FALSE)),\"\"))=0,\"\",(IFERROR((VLOOKUP(Tabla1[[#This Row],[Material]],T_BaseDatos[[Material]:[Factor de resistencia a la\ndifusión del vapor de agua]],3,FALSE)),\"\")))","v":""},{"$f":"IF((IFERROR((IF((VLOOKUP(Tabla1[[#This Row],[Material]],T_BaseDatos[[Material]:[Factor de resistencia a la\ndifusión del vapor de agua]],4,FALSE))=0,(Tabla1[[#This Row],[Espesor de cálculo\n(m)]]/Tabla1[[#This Row],[Conductividad térmica\n(W/mK)]]),(VLOOKUP(Tabla1[[#This Row],[Material]],T_BaseDatos[[Material]:[Factor de resistencia a la\ndifusión del vapor de agua]],4,FALSE)))),\"\"))=0,\"\",(IFERROR((IF((VLOOKUP(Tabla1[[#This Row],[Material]],T_BaseDatos[[Material]:[Factor de resistencia a la\ndifusión del vapor de agua]],4,FALSE))=0,(Tabla1[[#This Row],[Espesor de cálculo\n(m)]]/Tabla1[[#This Row],[Conductividad térmica\n(W/mK)]]),(VLOOKUP(Tabla1[[#This Row],[Material]],T_BaseDatos[[Material]:[Factor de resistencia a la\ndifusión del vapor de agua]],4,FALSE)))),\"\")))","v":""}]
[null,null,null,null,null,{"$f":"IF((IFERROR((IF((VLOOKUP(Tabla1[[#This Row],[Material]],T_BaseDatos[[Material]:[Factor de resistencia a la\ndifusión del vapor de agua]],2,FALSE))=0,Tabla1[[#This Row],[Espesor\n(m)]],(VLOOKUP(Tabla1[[#This Row],[Material]],T_BaseDatos[[Material]:[Factor de resistencia a la\ndifusión del vapor de agua]],2,FALSE)))),\"\"))=0,\"\",(IFERROR((IF((VLOOKUP(Tabla1[[#This Row],[Material]],T_BaseDatos[[Material]:[Factor de resistencia a la\ndifusión del vapor de agua]],2,FALSE))=0,Tabla1[[#This Row],[Espesor\n(m)]],(VLOOKUP(Tabla1[[#This Row],[Material]],T_BaseDatos[[Material]:[Factor de resistencia a la\ndifusión del vapor de agua]],2,FALSE)))),\"\")))","v":""},{"$f":"IF((IFERROR((VLOOKUP(Tabla1[[#This Row],[Material]],T_BaseDatos[[Material]:[Factor de resistencia a la\ndifusión del vapor de agua]],3,FALSE)),\"\"))=0,\"\",(IFERROR((VLOOKUP(Tabla1[[#This Row],[Material]],T_BaseDatos[[Material]:[Factor de resistencia a la\ndifusión del vapor de agua]],3,FALSE)),\"\")))","v":""},{"$f":"IF((IFERROR((IF((VLOOKUP(Tabla1[[#This Row],[Material]],T_BaseDatos[[Material]:[Factor de resistencia a la\ndifusión del vapor de agua]],4,FALSE))=0,(Tabla1[[#This Row],[Espesor de cálculo\n(m)]]/Tabla1[[#This Row],[Conductividad térmica\n(W/mK)]]),(VLOOKUP(Tabla1[[#This Row],[Material]],T_BaseDatos[[Material]:[Factor de resistencia a la\ndifusión del vapor de agua]],4,FALSE)))),\"\"))=0,\"\",(IFERROR((IF((VLOOKUP(Tabla1[[#This Row],[Material]],T_BaseDatos[[Material]:[Factor de resistencia a la\ndifusión del vapor de agua]],4,FALSE))=0,(Tabla1[[#This Row],[Espesor de cálculo\n(m)]]/Tabla1[[#This Row],[Conductividad térmica\n(W/mK)]]),(VLOOKUP(Tabla1[[#This Row],[Material]],T_BaseDatos[[Material]:[Factor de resistencia a la\ndifusión del vapor de agua]],4,FALSE)))),\"\")))","v":""}]
[null,null,null,null,null,{"$f":"IF((IFERROR((IF((VLOOKUP(Tabla1[[#This Row],[Material]],T_BaseDatos[[Material]:[Factor de resistencia a la\ndifusión del vapor de agua]],2,FALSE))=0,Tabla1[[#This Row],[Espesor\n(m)]],(VLOOKUP(Tabla1[[#This Row],[Material]],T_BaseDatos[[Material]:[Factor de resistencia a la\ndifusión del vapor de agua]],2,FALSE)))),\"\"))=0,\"\",(IFERROR((IF((VLOOKUP(Tabla1[[#This Row],[Material]],T_BaseDatos[[Material]:[Factor de resistencia a la\ndifusión del vapor de agua]],2,FALSE))=0,Tabla1[[#This Row],[Espesor\n(m)]],(VLOOKUP(Tabla1[[#This Row],[Material]],T_BaseDatos[[Material]:[Factor de resistencia a la\ndifusión del vapor de agua]],2,FALSE)))),\"\")))","v":""},{"$f":"IF((IFERROR((VLOOKUP(Tabla1[[#This Row],[Material]],T_BaseDatos[[Material]:[Factor de resistencia a la\ndifusión del vapor de agua]],3,FALSE)),\"\"))=0,\"\",(IFERROR((VLOOKUP(Tabla1[[#This Row],[Material]],T_BaseDatos[[Material]:[Factor de resistencia a la\ndifusión del vapor de agua]],3,FALSE)),\"\")))","v":""},{"$f":"IF((IFERROR((IF((VLOOKUP(Tabla1[[#This Row],[Material]],T_BaseDatos[[Material]:[Factor de resistencia a la\ndifusión del vapor de agua]],4,FALSE))=0,(Tabla1[[#This Row],[Espesor de cálculo\n(m)]]/Tabla1[[#This Row],[Conductividad térmica\n(W/mK)]]),(VLOOKUP(Tabla1[[#This Row],[Material]],T_BaseDatos[[Material]:[Factor de resistencia a la\ndifusión del vapor de agua]],4,FALSE)))),\"\"))=0,\"\",(IFERROR((IF((VLOOKUP(Tabla1[[#This Row],[Material]],T_BaseDatos[[Material]:[Factor de resistencia a la\ndifusión del vapor de agua]],4,FALSE))=0,(Tabla1[[#This Row],[Espesor de cálculo\n(m)]]/Tabla1[[#This Row],[Conductividad térmica\n(W/mK)]]),(VLOOKUP(Tabla1[[#This Row],[Material]],T_BaseDatos[[Material]:[Factor de resistencia a la\ndifusión del vapor de agua]],4,FALSE)))),\"\")))","v":""}]
[null,null,null,null,null,{"$f":"IF((IFERROR((IF((VLOOKUP(Tabla1[[#This Row],[Material]],T_BaseDatos[[Material]:[Factor de resistencia a la\ndifusión del vapor de agua]],2,FALSE))=0,Tabla1[[#This Row],[Espesor\n(m)]],(VLOOKUP(Tabla1[[#This Row],[Material]],T_BaseDatos[[Material]:[Factor de resistencia a la\ndifusión del vapor de agua]],2,FALSE)))),\"\"))=0,\"\",(IFERROR((IF((VLOOKUP(Tabla1[[#This Row],[Material]],T_BaseDatos[[Material]:[Factor de resistencia a la\ndifusión del vapor de agua]],2,FALSE))=0,Tabla1[[#This Row],[Espesor\n(m)]],(VLOOKUP(Tabla1[[#This Row],[Material]],T_BaseDatos[[Material]:[Factor de resistencia a la\ndifusión del vapor de agua]],2,FALSE)))),\"\")))","v":""},{"$f":"IF((IFERROR((VLOOKUP(Tabla1[[#This Row],[Material]],T_BaseDatos[[Material]:[Factor de resistencia a la\ndifusión del vapor de agua]],3,FALSE)),\"\"))=0,\"\",(IFERROR((VLOOKUP(Tabla1[[#This Row],[Material]],T_BaseDatos[[Material]:[Factor de resistencia a la\ndifusión del vapor de agua]],3,FALSE)),\"\")))","v":""},{"$f":"IF((IFERROR((IF((VLOOKUP(Tabla1[[#This Row],[Material]],T_BaseDatos[[Material]:[Factor de resistencia a la\ndifusión del vapor de agua]],4,FALSE))=0,(Tabla1[[#This Row],[Espesor de cálculo\n(m)]]/Tabla1[[#This Row],[Conductividad térmica\n(W/mK)]]),(VLOOKUP(Tabla1[[#This Row],[Material]],T_BaseDatos[[Material]:[Factor de resistencia a la\ndifusión del vapor de agua]],4,FALSE)))),\"\"))=0,\"\",(IFERROR((IF((VLOOKUP(Tabla1[[#This Row],[Material]],T_BaseDatos[[Material]:[Factor de resistencia a la\ndifusión del vapor de agua]],4,FALSE))=0,(Tabla1[[#This Row],[Espesor de cálculo\n(m)]]/Tabla1[[#This Row],[Conductividad térmica\n(W/mK)]]),(VLOOKUP(Tabla1[[#This Row],[Material]],T_BaseDatos[[Material]:[Factor de resistencia a la\ndifusión del vapor de agua]],4,FALSE)))),\"\")))","v":""}]
[null,null,null,null,null,{"$f":"IF((IFERROR((IF((VLOOKUP(Tabla1[[#This Row],[Material]],T_BaseDatos[[Material]:[Factor de resistencia a la\ndifusión del vapor de agua]],2,FALSE))=0,Tabla1[[#This Row],[Espesor\n(m)]],(VLOOKUP(Tabla1[[#This Row],[Material]],T_BaseDatos[[Material]:[Factor de resistencia a la\ndifusión del vapor de agua]],2,FALSE)))),\"\"))=0,\"\",(IFERROR((IF((VLOOKUP(Tabla1[[#This Row],[Material]],T_BaseDatos[[Material]:[Factor de resistencia a la\ndifusión del vapor de agua]],2,FALSE))=0,Tabla1[[#This Row],[Espesor\n(m)]],(VLOOKUP(Tabla1[[#This Row],[Material]],T_BaseDatos[[Material]:[Factor de resistencia a la\ndifusión del vapor de agua]],2,FALSE)))),\"\")))","v":""},{"$f":"IF((IFERROR((VLOOKUP(Tabla1[[#This Row],[Material]],T_BaseDatos[[Material]:[Factor de resistencia a la\ndifusión del vapor de agua]],3,FALSE)),\"\"))=0,\"\",(IFERROR((VLOOKUP(Tabla1[[#This Row],[Material]],T_BaseDatos[[Material]:[Factor de resistencia a la\ndifusión del vapor de agua]],3,FALSE)),\"\")))","v":""},{"$f":"IF((IFERROR((IF((VLOOKUP(Tabla1[[#This Row],[Material]],T_BaseDatos[[Material]:[Factor de resistencia a la\ndifusión del vapor de agua]],4,FALSE))=0,(Tabla1[[#This Row],[Espesor de cálculo\n(m)]]/Tabla1[[#This Row],[Conductividad térmica\n(W/mK)]]),(VLOOKUP(Tabla1[[#This Row],[Material]],T_BaseDatos[[Material]:[Factor de resistencia a la\ndifusión del vapor de agua]],4,FALSE)))),\"\"))=0,\"\",(IFERROR((IF((VLOOKUP(Tabla1[[#This Row],[Material]],T_BaseDatos[[Material]:[Factor de resistencia a la\ndifusión del vapor de agua]],4,FALSE))=0,(Tabla1[[#This Row],[Espesor de cálculo\n(m)]]/Tabla1[[#This Row],[Conductividad térmica\n(W/mK)]]),(VLOOKUP(Tabla1[[#This Row],[Material]],T_BaseDatos[[Material]:[Factor de resistencia a la\ndifusión del vapor de agua]],4,FALSE)))),\"\")))","v":""}]
[null,null,null,null,null,{"$f":"IF((IFERROR((IF((VLOOKUP(Tabla1[[#This Row],[Material]],T_BaseDatos[[Material]:[Factor de resistencia a la\ndifusión del vapor de agua]],2,FALSE))=0,Tabla1[[#This Row],[Espesor\n(m)]],(VLOOKUP(Tabla1[[#This Row],[Material]],T_BaseDatos[[Material]:[Factor de resistencia a la\ndifusión del vapor de agua]],2,FALSE)))),\"\"))=0,\"\",(IFERROR((IF((VLOOKUP(Tabla1[[#This Row],[Material]],T_BaseDatos[[Material]:[Factor de resistencia a la\ndifusión del vapor de agua]],2,FALSE))=0,Tabla1[[#This Row],[Espesor\n(m)]],(VLOOKUP(Tabla1[[#This Row],[Material]],T_BaseDatos[[Material]:[Factor de resistencia a la\ndifusión del vapor de agua]],2,FALSE)))),\"\")))","v":""},{"$f":"IF((IFERROR((VLOOKUP(Tabla1[[#This Row],[Material]],T_BaseDatos[[Material]:[Factor de resistencia a la\ndifusión del vapor de agua]],3,FALSE)),\"\"))=0,\"\",(IFERROR((VLOOKUP(Tabla1[[#This Row],[Material]],T_BaseDatos[[Material]:[Factor de resistencia a la\ndifusión del vapor de agua]],3,FALSE)),\"\")))","v":""},{"$f":"IF((IFERROR((IF((VLOOKUP(Tabla1[[#This Row],[Material]],T_BaseDatos[[Material]:[Factor de resistencia a la\ndifusión del vapor de agua]],4,FALSE))=0,(Tabla1[[#This Row],[Espesor de cálculo\n(m)]]/Tabla1[[#This Row],[Conductividad térmica\n(W/mK)]]),(VLOOKUP(Tabla1[[#This Row],[Material]],T_BaseDatos[[Material]:[Factor de resistencia a la\ndifusión del vapor de agua]],4,FALSE)))),\"\"))=0,\"\",(IFERROR((IF((VLOOKUP(Tabla1[[#This Row],[Material]],T_BaseDatos[[Material]:[Factor de resistencia a la\ndifusión del vapor de agua]],4,FALSE))=0,(Tabla1[[#This Row],[Espesor de cálculo\n(m)]]/Tabla1[[#This Row],[Conductividad térmica\n(W/mK)]]),(VLOOKUP(Tabla1[[#This Row],[Material]],T_BaseDatos[[Material]:[Factor de resistencia a la\ndifusión del vapor de agua]],4,FALSE)))),\"\")))","v":""}]
[null,null,null,null,null,{"$f":"IF((IFERROR((IF((VLOOKUP(Tabla1[[#This Row],[Material]],T_BaseDatos[[Material]:[Factor de resistencia a la\ndifusión del vapor de agua]],2,FALSE))=0,Tabla1[[#This Row],[Espesor\n(m)]],(VLOOKUP(Tabla1[[#This Row],[Material]],T_BaseDatos[[Material]:[Factor de resistencia a la\ndifusión del vapor de agua]],2,FALSE)))),\"\"))=0,\"\",(IFERROR((IF((VLOOKUP(Tabla1[[#This Row],[Material]],T_BaseDatos[[Material]:[Factor de resistencia a la\ndifusión del vapor de agua]],2,FALSE))=0,Tabla1[[#This Row],[Espesor\n(m)]],(VLOOKUP(Tabla1[[#This Row],[Material]],T_BaseDatos[[Material]:[Factor de resistencia a la\ndifusión del vapor de agua]],2,FALSE)))),\"\")))","v":""},{"$f":"IF((IFERROR((VLOOKUP(Tabla1[[#This Row],[Material]],T_BaseDatos[[Material]:[Factor de resistencia a la\ndifusión del vapor de agua]],3,FALSE)),\"\"))=0,\"\",(IFERROR((VLOOKUP(Tabla1[[#This Row],[Material]],T_BaseDatos[[Material]:[Factor de resistencia a la\ndifusión del vapor de agua]],3,FALSE)),\"\")))","v":""},{"$f":"IF((IFERROR((IF((VLOOKUP(Tabla1[[#This Row],[Material]],T_BaseDatos[[Material]:[Factor de resistencia a la\ndifusión del vapor de agua]],4,FALSE))=0,(Tabla1[[#This Row],[Espesor de cálculo\n(m)]]/Tabla1[[#This Row],[Conductividad térmica\n(W/mK)]]),(VLOOKUP(Tabla1[[#This Row],[Material]],T_BaseDatos[[Material]:[Factor de resistencia a la\ndifusión del vapor de agua]],4,FALSE)))),\"\"))=0,\"\",(IFERROR((IF((VLOOKUP(Tabla1[[#This Row],[Material]],T_BaseDatos[[Material]:[Factor de resistencia a la\ndifusión del vapor de agua]],4,FALSE))=0,(Tabla1[[#This Row],[Espesor de cálculo\n(m)]]/Tabla1[[#This Row],[Conductividad térmica\n(W/mK)]]),(VLOOKUP(Tabla1[[#This Row],[Material]],T_BaseDatos[[Material]:[Factor de resistencia a la\ndifusión del vapor de agua]],4,FALSE)))),\"\")))","v":""}]
[null,null,null,null,null,{"$f":"IF((IFERROR((IF((VLOOKUP(Tabla1[[#This Row],[Material]],T_BaseDatos[[Material]:[Factor de resistencia a la\ndifusión del vapor de agua]],2,FALSE))=0,Tabla1[[#This Row],[Espesor\n(m)]],(VLOOKUP(Tabla1[[#This Row],[Material]],T_BaseDatos[[Material]:[Factor de resistencia a la\ndifusión del vapor de agua]],2,FALSE)))),\"\"))=0,\"\",(IFERROR((IF((VLOOKUP(Tabla1[[#This Row],[Material]],T_BaseDatos[[Material]:[Factor de resistencia a la\ndifusión del vapor de agua]],2,FALSE))=0,Tabla1[[#This Row],[Espesor\n(m)]],(VLOOKUP(Tabla1[[#This Row],[Material]],T_BaseDatos[[Material]:[Factor de resistencia a la\ndifusión del vapor de agua]],2,FALSE)))),\"\")))","v":""},{"$f":"IF((IFERROR((VLOOKUP(Tabla1[[#This Row],[Material]],T_BaseDatos[[Material]:[Factor de resistencia a la\ndifusión del vapor de agua]],3,FALSE)),\"\"))=0,\"\",(IFERROR((VLOOKUP(Tabla1[[#This Row],[Material]],T_BaseDatos[[Material]:[Factor de resistencia a la\ndifusión del vapor de agua]],3,FALSE)),\"\")))","v":""},{"$f":"IF((IFERROR((IF((VLOOKUP(Tabla1[[#This Row],[Material]],T_BaseDatos[[Material]:[Factor de resistencia a la\ndifusión del vapor de agua]],4,FALSE))=0,(Tabla1[[#This Row],[Espesor de cálculo\n(m)]]/Tabla1[[#This Row],[Conductividad térmica\n(W/mK)]]),(VLOOKUP(Tabla1[[#This Row],[Material]],T_BaseDatos[[Material]:[Factor de resistencia a la\ndifusión del vapor de agua]],4,FALSE)))),\"\"))=0,\"\",(IFERROR((IF((VLOOKUP(Tabla1[[#This Row],[Material]],T_BaseDatos[[Material]:[Factor de resistencia a la\ndifusión del vapor de agua]],4,FALSE))=0,(Tabla1[[#This Row],[Espesor de cálculo\n(m)]]/Tabla1[[#This Row],[Conductividad térmica\n(W/mK)]]),(VLOOKUP(Tabla1[[#This Row],[Material]],T_BaseDatos[[Material]:[Factor de resistencia a la\ndifusión del vapor de agua]],4,FALSE)))),\"\")))","v":""}]
[null,null,null,null,null,{"$f":"IF((IFERROR((IF((VLOOKUP(Tabla1[[#This Row],[Material]],T_BaseDatos[[Material]:[Factor de resistencia a la\ndifusión del vapor de agua]],2,FALSE))=0,Tabla1[[#This Row],[Espesor\n(m)]],(VLOOKUP(Tabla1[[#This Row],[Material]],T_BaseDatos[[Material]:[Factor de resistencia a la\ndifusión del vapor de agua]],2,FALSE)))),\"\"))=0,\"\",(IFERROR((IF((VLOOKUP(Tabla1[[#This Row],[Material]],T_BaseDatos[[Material]:[Factor de resistencia a la\ndifusión del vapor de agua]],2,FALSE))=0,Tabla1[[#This Row],[Espesor\n(m)]],(VLOOKUP(Tabla1[[#This Row],[Material]],T_BaseDatos[[Material]:[Factor de resistencia a la\ndifusión del vapor de agua]],2,FALSE)))),\"\")))","v":""},{"$f":"IF((IFERROR((VLOOKUP(Tabla1[[#This Row],[Material]],T_BaseDatos[[Material]:[Factor de resistencia a la\ndifusión del vapor de agua]],3,FALSE)),\"\"))=0,\"\",(IFERROR((VLOOKUP(Tabla1[[#This Row],[Material]],T_BaseDatos[[Material]:[Factor de resistencia a la\ndifusión del vapor de agua]],3,FALSE)),\"\")))","v":""},{"$f":"IF((IFERROR((IF((VLOOKUP(Tabla1[[#This Row],[Material]],T_BaseDatos[[Material]:[Factor de resistencia a la\ndifusión del vapor de agua]],4,FALSE))=0,(Tabla1[[#This Row],[Espesor de cálculo\n(m)]]/Tabla1[[#This Row],[Conductividad térmica\n(W/mK)]]),(VLOOKUP(Tabla1[[#This Row],[Material]],T_BaseDatos[[Material]:[Factor de resistencia a la\ndifusión del vapor de agua]],4,FALSE)))),\"\"))=0,\"\",(IFERROR((IF((VLOOKUP(Tabla1[[#This Row],[Material]],T_BaseDatos[[Material]:[Factor de resistencia a la\ndifusión del vapor de agua]],4,FALSE))=0,(Tabla1[[#This Row],[Espesor de cálculo\n(m)]]/Tabla1[[#This Row],[Conductividad térmica\n(W/mK)]]),(VLOOKUP(Tabla1[[#This Row],[Material]],T_BaseDatos[[Material]:[Factor de resistencia a la\ndifusión del vapor de agua]],4,FALSE)))),\"\")))","v":""}]
[null,null,null,null,null,{"$f":"IF((IFERROR((IF((VLOOKUP(Tabla1[[#This Row],[Material]],T_BaseDatos[[Material]:[Factor de resistencia a la\ndifusión del vapor de agua]],2,FALSE))=0,Tabla1[[#This Row],[Espesor\n(m)]],(VLOOKUP(Tabla1[[#This Row],[Material]],T_BaseDatos[[Material]:[Factor de resistencia a la\ndifusión del vapor de agua]],2,FALSE)))),\"\"))=0,\"\",(IFERROR((IF((VLOOKUP(Tabla1[[#This Row],[Material]],T_BaseDatos[[Material]:[Factor de resistencia a la\ndifusión del vapor de agua]],2,FALSE))=0,Tabla1[[#This Row],[Espesor\n(m)]],(VLOOKUP(Tabla1[[#This Row],[Material]],T_BaseDatos[[Material]:[Factor de resistencia a la\ndifusión del vapor de agua]],2,FALSE)))),\"\")))","v":""},{"$f":"IF((IFERROR((VLOOKUP(Tabla1[[#This Row],[Material]],T_BaseDatos[[Material]:[Factor de resistencia a la\ndifusión del vapor de agua]],3,FALSE)),\"\"))=0,\"\",(IFERROR((VLOOKUP(Tabla1[[#This Row],[Material]],T_BaseDatos[[Material]:[Factor de resistencia a la\ndifusión del vapor de agua]],3,FALSE)),\"\")))","v":""},{"$f":"IF((IFERROR((IF((VLOOKUP(Tabla1[[#This Row],[Material]],T_BaseDatos[[Material]:[Factor de resistencia a la\ndifusión del vapor de agua]],4,FALSE))=0,(Tabla1[[#This Row],[Espesor de cálculo\n(m)]]/Tabla1[[#This Row],[Conductividad térmica\n(W/mK)]]),(VLOOKUP(Tabla1[[#This Row],[Material]],T_BaseDatos[[Material]:[Factor de resistencia a la\ndifusión del vapor de agua]],4,FALSE)))),\"\"))=0,\"\",(IFERROR((IF((VLOOKUP(Tabla1[[#This Row],[Material]],T_BaseDatos[[Material]:[Factor de resistencia a la\ndifusión del vapor de agua]],4,FALSE))=0,(Tabla1[[#This Row],[Espesor de cálculo\n(m)]]/Tabla1[[#This Row],[Conductividad térmica\n(W/mK)]]),(VLOOKUP(Tabla1[[#This Row],[Material]],T_BaseDatos[[Material]:[Factor de resistencia a la\ndifusión del vapor de agua]],4,FALSE)))),\"\")))","v":""}]
[null,null,null,null,null,{"$f":"IF((IFERROR((IF((VLOOKUP(Tabla1[[#This Row],[Material]],T_BaseDatos[[Material]:[Factor de resistencia a la\ndifusión del vapor de agua]],2,FALSE))=0,Tabla1[[#This Row],[Espesor\n(m)]],(VLOOKUP(Tabla1[[#This Row],[Material]],T_BaseDatos[[Material]:[Factor de resistencia a la\ndifusión del vapor de agua]],2,FALSE)))),\"\"))=0,\"\",(IFERROR((IF((VLOOKUP(Tabla1[[#This Row],[Material]],T_BaseDatos[[Material]:[Factor de resistencia a la\ndifusión del vapor de agua]],2,FALSE))=0,Tabla1[[#This Row],[Espesor\n(m)]],(VLOOKUP(Tabla1[[#This Row],[Material]],T_BaseDatos[[Material]:[Factor de resistencia a la\ndifusión del vapor de agua]],2,FALSE)))),\"\")))","v":""},{"$f":"IF((IFERROR((VLOOKUP(Tabla1[[#This Row],[Material]],T_BaseDatos[[Material]:[Factor de resistencia a la\ndifusión del vapor de agua]],3,FALSE)),\"\"))=0,\"\",(IFERROR((VLOOKUP(Tabla1[[#This Row],[Material]],T_BaseDatos[[Material]:[Factor de resistencia a la\ndifusión del vapor de agua]],3,FALSE)),\"\")))","v":""},{"$f":"IF((IFERROR((IF((VLOOKUP(Tabla1[[#This Row],[Material]],T_BaseDatos[[Material]:[Factor de resistencia a la\ndifusión del vapor de agua]],4,FALSE))=0,(Tabla1[[#This Row],[Espesor de cálculo\n(m)]]/Tabla1[[#This Row],[Conductividad térmica\n(W/mK)]]),(VLOOKUP(Tabla1[[#This Row],[Material]],T_BaseDatos[[Material]:[Factor de resistencia a la\ndifusión del vapor de agua]],4,FALSE)))),\"\"))=0,\"\",(IFERROR((IF((VLOOKUP(Tabla1[[#This Row],[Material]],T_BaseDatos[[Material]:[Factor de resistencia a la\ndifusión del vapor de agua]],4,FALSE))=0,(Tabla1[[#This Row],[Espesor de cálculo\n(m)]]/Tabla1[[#This Row],[Conductividad térmica\n(W/mK)]]),(VLOOKUP(Tabla1[[#This Row],[Material]],T_BaseDatos[[Material]:[Factor de resistencia a la\ndifusión del vapor de agua]],4,FALSE)))),\"\")))","v":""}]
[null,null,null,null,null,{"$f":"IF((IFERROR((IF((VLOOKUP(Tabla1[[#This Row],[Material]],T_BaseDatos[[Material]:[Factor de resistencia a la\ndifusión del vapor de agua]],2,FALSE))=0,Tabla1[[#This Row],[Espesor\n(m)]],(VLOOKUP(Tabla1[[#This Row],[Material]],T_BaseDatos[[Material]:[Factor de resistencia a la\ndifusión del vapor de agua]],2,FALSE)))),\"\"))=0,\"\",(IFERROR((IF((VLOOKUP(Tabla1[[#This Row],[Material]],T_BaseDatos[[Material]:[Factor de resistencia a la\ndifusión del vapor de agua]],2,FALSE))=0,Tabla1[[#This Row],[Espesor\n(m)]],(VLOOKUP(Tabla1[[#This Row],[Material]],T_BaseDatos[[Material]:[Factor de resistencia a la\ndifusión del vapor de agua]],2,FALSE)))),\"\")))","v":""},{"$f":"IF((IFERROR((VLOOKUP(Tabla1[[#This Row],[Material]],T_BaseDatos[[Material]:[Factor de resistencia a la\ndifusión del vapor de agua]],3,FALSE)),\"\"))=0,\"\",(IFERROR((VLOOKUP(Tabla1[[#This Row],[Material]],T_BaseDatos[[Material]:[Factor de resistencia a la\ndifusión del vapor de agua]],3,FALSE)),\"\")))","v":""},{"$f":"IF((IFERROR((IF((VLOOKUP(Tabla1[[#This Row],[Material]],T_BaseDatos[[Material]:[Factor de resistencia a la\ndifusión del vapor de agua]],4,FALSE))=0,(Tabla1[[#This Row],[Espesor de cálculo\n(m)]]/Tabla1[[#This Row],[Conductividad térmica\n(W/mK)]]),(VLOOKUP(Tabla1[[#This Row],[Material]],T_BaseDatos[[Material]:[Factor de resistencia a la\ndifusión del vapor de agua]],4,FALSE)))),\"\"))=0,\"\",(IFERROR((IF((VLOOKUP(Tabla1[[#This Row],[Material]],T_BaseDatos[[Material]:[Factor de resistencia a la\ndifusión del vapor de agua]],4,FALSE))=0,(Tabla1[[#This Row],[Espesor de cálculo\n(m)]]/Tabla1[[#This Row],[Conductividad térmica\n(W/mK)]]),(VLOOKUP(Tabla1[[#This Row],[Material]],T_BaseDatos[[Material]:[Factor de resistencia a la\ndifusión del vapor de agua]],4,FALSE)))),\"\")))","v":""}]
[null,null,null,null,null,{"$f":"IF((IFERROR((IF((VLOOKUP(Tabla1[[#This Row],[Material]],T_BaseDatos[[Material]:[Factor de resistencia a la\ndifusión del vapor de agua]],2,FALSE))=0,Tabla1[[#This Row],[Espesor\n(m)]],(VLOOKUP(Tabla1[[#This Row],[Material]],T_BaseDatos[[Material]:[Factor de resistencia a la\ndifusión del vapor de agua]],2,FALSE)))),\"\"))=0,\"\",(IFERROR((IF((VLOOKUP(Tabla1[[#This Row],[Material]],T_BaseDatos[[Material]:[Factor de resistencia a la\ndifusión del vapor de agua]],2,FALSE))=0,Tabla1[[#This Row],[Espesor\n(m)]],(VLOOKUP(Tabla1[[#This Row],[Material]],T_BaseDatos[[Material]:[Factor de resistencia a la\ndifusión del vapor de agua]],2,FALSE)))),\"\")))","v":""},{"$f":"IF((IFERROR((VLOOKUP(Tabla1[[#This Row],[Material]],T_BaseDatos[[Material]:[Factor de resistencia a la\ndifusión del vapor de agua]],3,FALSE)),\"\"))=0,\"\",(IFERROR((VLOOKUP(Tabla1[[#This Row],[Material]],T_BaseDatos[[Material]:[Factor de resistencia a la\ndifusión del vapor de agua]],3,FALSE)),\"\")))","v":""},{"$f":"IF((IFERROR((IF((VLOOKUP(Tabla1[[#This Row],[Material]],T_BaseDatos[[Material]:[Factor de resistencia a la\ndifusión del vapor de agua]],4,FALSE))=0,(Tabla1[[#This Row],[Espesor de cálculo\n(m)]]/Tabla1[[#This Row],[Conductividad térmica\n(W/mK)]]),(VLOOKUP(Tabla1[[#This Row],[Material]],T_BaseDatos[[Material]:[Factor de resistencia a la\ndifusión del vapor de agua]],4,FALSE)))),\"\"))=0,\"\",(IFERROR((IF((VLOOKUP(Tabla1[[#This Row],[Material]],T_BaseDatos[[Material]:[Factor de resistencia a la\ndifusión del vapor de agua]],4,FALSE))=0,(Tabla1[[#This Row],[Espesor de cálculo\n(m)]]/Tabla1[[#This Row],[Conductividad térmica\n(W/mK)]]),(VLOOKUP(Tabla1[[#This Row],[Material]],T_BaseDatos[[Material]:[Factor de resistencia a la\ndifusión del vapor de agua]],4,FALSE)))),\"\")))","v":""}]
[null,null,null,null,null,{"$f":"IF((IFERROR((IF((VLOOKUP(Tabla1[[#This Row],[Material]],T_BaseDatos[[Material]:[Factor de resistencia a la\ndifusión del vapor de agua]],2,FALSE))=0,Tabla1[[#This Row],[Espesor\n(m)]],(VLOOKUP(Tabla1[[#This Row],[Material]],T_BaseDatos[[Material]:[Factor de resistencia a la\ndifusión del vapor de agua]],2,FALSE)))),\"\"))=0,\"\",(IFERROR((IF((VLOOKUP(Tabla1[[#This Row],[Material]],T_BaseDatos[[Material]:[Factor de resistencia a la\ndifusión del vapor de agua]],2,FALSE))=0,Tabla1[[#This Row],[Espesor\n(m)]],(VLOOKUP(Tabla1[[#This Row],[Material]],T_BaseDatos[[Material]:[Factor de resistencia a la\ndifusión del vapor de agua]],2,FALSE)))),\"\")))","v":""},{"$f":"IF((IFERROR((VLOOKUP(Tabla1[[#This Row],[Material]],T_BaseDatos[[Material]:[Factor de resistencia a la\ndifusión del vapor de agua]],3,FALSE)),\"\"))=0,\"\",(IFERROR((VLOOKUP(Tabla1[[#This Row],[Material]],T_BaseDatos[[Material]:[Factor de resistencia a la\ndifusión del vapor de agua]],3,FALSE)),\"\")))","v":""},{"$f":"IF((IFERROR((IF((VLOOKUP(Tabla1[[#This Row],[Material]],T_BaseDatos[[Material]:[Factor de resistencia a la\ndifusión del vapor de agua]],4,FALSE))=0,(Tabla1[[#This Row],[Espesor de cálculo\n(m)]]/Tabla1[[#This Row],[Conductividad térmica\n(W/mK)]]),(VLOOKUP(Tabla1[[#This Row],[Material]],T_BaseDatos[[Material]:[Factor de resistencia a la\ndifusión del vapor de agua]],4,FALSE)))),\"\"))=0,\"\",(IFERROR((IF((VLOOKUP(Tabla1[[#This Row],[Material]],T_BaseDatos[[Material]:[Factor de resistencia a la\ndifusión del vapor de agua]],4,FALSE))=0,(Tabla1[[#This Row],[Espesor de cálculo\n(m)]]/Tabla1[[#This Row],[Conductividad térmica\n(W/mK)]]),(VLOOKUP(Tabla1[[#This Row],[Material]],T_BaseDatos[[Material]:[Factor de resistencia a la\ndifusión del vapor de agua]],4,FALSE)))),\"\")))","v":""}]
[null,null,null,null,null,{"$f":"IF((IFERROR((IF((VLOOKUP(Tabla1[[#This Row],[Material]],T_BaseDatos[[Material]:[Factor de resistencia a la\ndifusión del vapor de agua]],2,FALSE))=0,Tabla1[[#This Row],[Espesor\n(m)]],(VLOOKUP(Tabla1[[#This Row],[Material]],T_BaseDatos[[Material]:[Factor de resistencia a la\ndifusión del vapor de agua]],2,FALSE)))),\"\"))=0,\"\",(IFERROR((IF((VLOOKUP(Tabla1[[#This Row],[Material]],T_BaseDatos[[Material]:[Factor de resistencia a la\ndifusión del vapor de agua]],2,FALSE))=0,Tabla1[[#This Row],[Espesor\n(m)]],(VLOOKUP(Tabla1[[#This Row],[Material]],T_BaseDatos[[Material]:[Factor de resistencia a la\ndifusión del vapor de agua]],2,FALSE)))),\"\")))","v":""},{"$f":"IF((IFERROR((VLOOKUP(Tabla1[[#This Row],[Material]],T_BaseDatos[[Material]:[Factor de resistencia a la\ndifusión del vapor de agua]],3,FALSE)),\"\"))=0,\"\",(IFERROR((VLOOKUP(Tabla1[[#This Row],[Material]],T_BaseDatos[[Material]:[Factor de resistencia a la\ndifusión del vapor de agua]],3,FALSE)),\"\")))","v":""},{"$f":"IF((IFERROR((IF((VLOOKUP(Tabla1[[#This Row],[Material]],T_BaseDatos[[Material]:[Factor de resistencia a la\ndifusión del vapor de agua]],4,FALSE))=0,(Tabla1[[#This Row],[Espesor de cálculo\n(m)]]/Tabla1[[#This Row],[Conductividad térmica\n(W/mK)]]),(VLOOKUP(Tabla1[[#This Row],[Material]],T_BaseDatos[[Material]:[Factor de resistencia a la\ndifusión del vapor de agua]],4,FALSE)))),\"\"))=0,\"\",(IFERROR((IF((VLOOKUP(Tabla1[[#This Row],[Material]],T_BaseDatos[[Material]:[Factor de resistencia a la\ndifusión del vapor de agua]],4,FALSE))=0,(Tabla1[[#This Row],[Espesor de cálculo\n(m)]]/Tabla1[[#This Row],[Conductividad térmica\n(W/mK)]]),(VLOOKUP(Tabla1[[#This Row],[Material]],T_BaseDatos[[Material]:[Factor de resistencia a la\ndifusión del vapor de agua]],4,FALSE)))),\"\")))","v":""}]
[null,null,null,null,null,{"$f":"IF((IFERROR((IF((VLOOKUP(Tabla1[[#This Row],[Material]],T_BaseDatos[[Material]:[Factor de resistencia a la\ndifusión del vapor de agua]],2,FALSE))=0,Tabla1[[#This Row],[Espesor\n(m)]],(VLOOKUP(Tabla1[[#This Row],[Material]],T_BaseDatos[[Material]:[Factor de resistencia a la\ndifusión del vapor de agua]],2,FALSE)))),\"\"))=0,\"\",(IFERROR((IF((VLOOKUP(Tabla1[[#This Row],[Material]],T_BaseDatos[[Material]:[Factor de resistencia a la\ndifusión del vapor de agua]],2,FALSE))=0,Tabla1[[#This Row],[Espesor\n(m)]],(VLOOKUP(Tabla1[[#This Row],[Material]],T_BaseDatos[[Material]:[Factor de resistencia a la\ndifusión del vapor de agua]],2,FALSE)))),\"\")))","v":""},{"$f":"IF((IFERROR((VLOOKUP(Tabla1[[#This Row],[Material]],T_BaseDatos[[Material]:[Factor de resistencia a la\ndifusión del vapor de agua]],3,FALSE)),\"\"))=0,\"\",(IFERROR((VLOOKUP(Tabla1[[#This Row],[Material]],T_BaseDatos[[Material]:[Factor de resistencia a la\ndifusión del vapor de agua]],3,FALSE)),\"\")))","v":""},{"$f":"IF((IFERROR((IF((VLOOKUP(Tabla1[[#This Row],[Material]],T_BaseDatos[[Material]:[Factor de resistencia a la\ndifusión del vapor de agua]],4,FALSE))=0,(Tabla1[[#This Row],[Espesor de cálculo\n(m)]]/Tabla1[[#This Row],[Conductividad térmica\n(W/mK)]]),(VLOOKUP(Tabla1[[#This Row],[Material]],T_BaseDatos[[Material]:[Factor de resistencia a la\ndifusión del vapor de agua]],4,FALSE)))),\"\"))=0,\"\",(IFERROR((IF((VLOOKUP(Tabla1[[#This Row],[Material]],T_BaseDatos[[Material]:[Factor de resistencia a la\ndifusión del vapor de agua]],4,FALSE))=0,(Tabla1[[#This Row],[Espesor de cálculo\n(m)]]/Tabla1[[#This Row],[Conductividad térmica\n(W/mK)]]),(VLOOKUP(Tabla1[[#This Row],[Material]],T_BaseDatos[[Material]:[Factor de resistencia a la\ndifusión del vapor de agua]],4,FALSE)))),\"\")))","v":""}]
[null,null,null,null,null,{"$f":"IF((IFERROR((IF((VLOOKUP(Tabla1[[#This Row],[Material]],T_BaseDatos[[Material]:[Factor de resistencia a la\ndifusión del vapor de agua]],2,FALSE))=0,Tabla1[[#This Row],[Espesor\n(m)]],(VLOOKUP(Tabla1[[#This Row],[Material]],T_BaseDatos[[Material]:[Factor de resistencia a la\ndifusión del vapor de agua]],2,FALSE)))),\"\"))=0,\"\",(IFERROR((IF((VLOOKUP(Tabla1[[#This Row],[Material]],T_BaseDatos[[Material]:[Factor de resistencia a la\ndifusión del vapor de agua]],2,FALSE))=0,Tabla1[[#This Row],[Espesor\n(m)]],(VLOOKUP(Tabla1[[#This Row],[Material]],T_BaseDatos[[Material]:[Factor de resistencia a la\ndifusión del vapor de agua]],2,FALSE)))),\"\")))","v":""},{"$f":"IF((IFERROR((VLOOKUP(Tabla1[[#This Row],[Material]],T_BaseDatos[[Material]:[Factor de resistencia a la\ndifusión del vapor de agua]],3,FALSE)),\"\"))=0,\"\",(IFERROR((VLOOKUP(Tabla1[[#This Row],[Material]],T_BaseDatos[[Material]:[Factor de resistencia a la\ndifusión del vapor de agua]],3,FALSE)),\"\")))","v":""},{"$f":"IF((IFERROR((IF((VLOOKUP(Tabla1[[#This Row],[Material]],T_BaseDatos[[Material]:[Factor de resistencia a la\ndifusión del vapor de agua]],4,FALSE))=0,(Tabla1[[#This Row],[Espesor de cálculo\n(m)]]/Tabla1[[#This Row],[Conductividad térmica\n(W/mK)]]),(VLOOKUP(Tabla1[[#This Row],[Material]],T_BaseDatos[[Material]:[Factor de resistencia a la\ndifusión del vapor de agua]],4,FALSE)))),\"\"))=0,\"\",(IFERROR((IF((VLOOKUP(Tabla1[[#This Row],[Material]],T_BaseDatos[[Material]:[Factor de resistencia a la\ndifusión del vapor de agua]],4,FALSE))=0,(Tabla1[[#This Row],[Espesor de cálculo\n(m)]]/Tabla1[[#This Row],[Conductividad térmica\n(W/mK)]]),(VLOOKUP(Tabla1[[#This Row],[Material]],T_BaseDatos[[Material]:[Factor de resistencia a la\ndifusión del vapor de agua]],4,FALSE)))),\"\")))","v":""}]
[null,null,null,null,null,{"$f":"IF((IFERROR((IF((VLOOKUP(Tabla1[[#This Row],[Material]],T_BaseDatos[[Material]:[Factor de resistencia a la\ndifusión del vapor de agua]],2,FALSE))=0,Tabla1[[#This Row],[Espesor\n(m)]],(VLOOKUP(Tabla1[[#This Row],[Material]],T_BaseDatos[[Material]:[Factor de resistencia a la\ndifusión del vapor de agua]],2,FALSE)))),\"\"))=0,\"\",(IFERROR((IF((VLOOKUP(Tabla1[[#This Row],[Material]],T_BaseDatos[[Material]:[Factor de resistencia a la\ndifusión del vapor de agua]],2,FALSE))=0,Tabla1[[#This Row],[Espesor\n(m)]],(VLOOKUP(Tabla1[[#This Row],[Material]],T_BaseDatos[[Material]:[Factor de resistencia a la\ndifusión del vapor de agua]],2,FALSE)))),\"\")))","v":""},{"$f":"IF((IFERROR((VLOOKUP(Tabla1[[#This Row],[Material]],T_BaseDatos[[Material]:[Factor de resistencia a la\ndifusión del vapor de agua]],3,FALSE)),\"\"))=0,\"\",(IFERROR((VLOOKUP(Tabla1[[#This Row],[Material]],T_BaseDatos[[Material]:[Factor de resistencia a la\ndifusión del vapor de agua]],3,FALSE)),\"\")))","v":""},{"$f":"IF((IFERROR((IF((VLOOKUP(Tabla1[[#This Row],[Material]],T_BaseDatos[[Material]:[Factor de resistencia a la\ndifusión del vapor de agua]],4,FALSE))=0,(Tabla1[[#This Row],[Espesor de cálculo\n(m)]]/Tabla1[[#This Row],[Conductividad térmica\n(W/mK)]]),(VLOOKUP(Tabla1[[#This Row],[Material]],T_BaseDatos[[Material]:[Factor de resistencia a la\ndifusión del vapor de agua]],4,FALSE)))),\"\"))=0,\"\",(IFERROR((IF((VLOOKUP(Tabla1[[#This Row],[Material]],T_BaseDatos[[Material]:[Factor de resistencia a la\ndifusión del vapor de agua]],4,FALSE))=0,(Tabla1[[#This Row],[Espesor de cálculo\n(m)]]/Tabla1[[#This Row],[Conductividad térmica\n(W/mK)]]),(VLOOKUP(Tabla1[[#This Row],[Material]],T_BaseDatos[[Material]:[Factor de resistencia a la\ndifusión del vapor de agua]],4,FALSE)))),\"\")))","v":""}]
[]
[]
[]
[null,null,"Solución Alternativa"]
[null,null,"Grupo de material","Material","Espesor\n(m)","Espesor de cálculo\n(m)","Conductividad térmica\n(W/mK)","Resistencia térmica\n(m²K/W)"]
[null,null,null,null,null,{"$f":"IF((IFERROR((IF((VLOOKUP(Tabla13[[#This Row],[Material]],T_BaseDatos[[Material]:[Factor de resistencia a la\ndifusión del vapor de agua]],2,FALSE))=0,Tabla13[[#This Row],[Espesor\n(m)]],(VLOOKUP(Tabla13[[#This Row],[Material]],T_BaseDatos[[Material]:[Factor de resistencia a la\ndifusión del vapor de agua]],2,FALSE)))),\"\"))=0,\"\",(IFERROR((IF((VLOOKUP(Tabla13[[#This Row],[Material]],T_BaseDatos[[Material]:[Factor de resistencia a la\ndifusión del vapor de agua]],2,FALSE))=0,Tabla13[[#This Row],[Espesor\n(m)]],(VLOOKUP(Tabla13[[#This Row],[Material]],T_BaseDatos[[Material]:[Factor de resistencia a la\ndifusión del vapor de agua]],2,FALSE)))),\"\")))","v":""},{"$f":"IF((IFERROR((VLOOKUP(Tabla13[[#This Row],[Material]],T_BaseDatos[[Material]:[Factor de resistencia a la\ndifusión del vapor de agua]],3,FALSE)),\"\"))=0,\"\",(IFERROR((VLOOKUP(Tabla13[[#This Row],[Material]],T_BaseDatos[[Material]:[Factor de resistencia a la\ndifusión del vapor de agua]],3,FALSE)),\"\")))","v":""},{"$f":"IF((IFERROR((IF((VLOOKUP(Tabla13[[#This Row],[Material]],T_BaseDatos[[Material]:[Factor de resistencia a la\ndifusión del vapor de agua]],4,FALSE))=0,(Tabla13[[#This Row],[Espesor de cálculo\n(m)]]/Tabla13[[#This Row],[Conductividad térmica\n(W/mK)]]),(VLOOKUP(Tabla13[[#This Row],[Material]],T_BaseDatos[[Material]:[Factor de resistencia a la\ndifusión del vapor de agua]],4,FALSE)))),\"\"))=0,\"\",(IFERROR((IF((VLOOKUP(Tabla13[[#This Row],[Material]],T_BaseDatos[[Material]:[Factor de resistencia a la\ndifusión del vapor de agua]],4,FALSE))=0,(Tabla13[[#This Row],[Espesor de cálculo\n(m)]]/Tabla13[[#This Row],[Conductividad térmica\n(W/mK)]]),(VLOOKUP(Tabla13[[#This Row],[Material]],T_BaseDatos[[Material]:[Factor de resistencia a la\ndifusión del vapor de agua]],4,FALSE)))),\"\")))","v":""}]
[null,null,null,null,null,{"$f":"IF((IFERROR((IF((VLOOKUP(Tabla13[[#This Row],[Material]],T_BaseDatos[[Material]:[Factor de resistencia a la\ndifusión del vapor de agua]],2,FALSE))=0,Tabla13[[#This Row],[Espesor\n(m)]],(VLOOKUP(Tabla13[[#This Row],[Material]],T_BaseDatos[[Material]:[Factor de resistencia a la\ndifusión del vapor de agua]],2,FALSE)))),\"\"))=0,\"\",(IFERROR((IF((VLOOKUP(Tabla13[[#This Row],[Material]],T_BaseDatos[[Material]:[Factor de resistencia a la\ndifusión del vapor de agua]],2,FALSE))=0,Tabla13[[#This Row],[Espesor\n(m)]],(VLOOKUP(Tabla13[[#This Row],[Material]],T_BaseDatos[[Material]:[Factor de resistencia a la\ndifusión del vapor de agua]],2,FALSE)))),\"\")))","v":""},{"$f":"IF((IFERROR((VLOOKUP(Tabla13[[#This Row],[Material]],T_BaseDatos[[Material]:[Factor de resistencia a la\ndifusión del vapor de agua]],3,FALSE)),\"\"))=0,\"\",(IFERROR((VLOOKUP(Tabla13[[#This Row],[Material]],T_BaseDatos[[Material]:[Factor de resistencia a la\ndifusión del vapor de agua]],3,FALSE)),\"\")))","v":""},{"$f":"IF((IFERROR((IF((VLOOKUP(Tabla13[[#This Row],[Material]],T_BaseDatos[[Material]:[Factor de resistencia a la\ndifusión del vapor de agua]],4,FALSE))=0,(Tabla13[[#This Row],[Espesor de cálculo\n(m)]]/Tabla13[[#This Row],[Conductividad térmica\n(W/mK)]]),(VLOOKUP(Tabla13[[#This Row],[Material]],T_BaseDatos[[Material]:[Factor de resistencia a la\ndifusión del vapor de agua]],4,FALSE)))),\"\"))=0,\"\",(IFERROR((IF((VLOOKUP(Tabla13[[#This Row],[Material]],T_BaseDatos[[Material]:[Factor de resistencia a la\ndifusión del vapor de agua]],4,FALSE))=0,(Tabla13[[#This Row],[Espesor de cálculo\n(m)]]/Tabla13[[#This Row],[Conductividad térmica\n(W/mK)]]),(VLOOKUP(Tabla13[[#This Row],[Material]],T_BaseDatos[[Material]:[Factor de resistencia a la\ndifusión del vapor de agua]],4,FALSE)))),\"\")))","v":""}]
[null,null,null,null,null,{"$f":"IF((IFERROR((IF((VLOOKUP(Tabla13[[#This Row],[Material]],T_BaseDatos[[Material]:[Factor de resistencia a la\ndifusión del vapor de agua]],2,FALSE))=0,Tabla13[[#This Row],[Espesor\n(m)]],(VLOOKUP(Tabla13[[#This Row],[Material]],T_BaseDatos[[Material]:[Factor de resistencia a la\ndifusión del vapor de agua]],2,FALSE)))),\"\"))=0,\"\",(IFERROR((IF((VLOOKUP(Tabla13[[#This Row],[Material]],T_BaseDatos[[Material]:[Factor de resistencia a la\ndifusión del vapor de agua]],2,FALSE))=0,Tabla13[[#This Row],[Espesor\n(m)]],(VLOOKUP(Tabla13[[#This Row],[Material]],T_BaseDatos[[Material]:[Factor de resistencia a la\ndifusión del vapor de agua]],2,FALSE)))),\"\")))","v":""},{"$f":"IF((IFERROR((VLOOKUP(Tabla13[[#This Row],[Material]],T_BaseDatos[[Material]:[Factor de resistencia a la\ndifusión del vapor de agua]],3,FALSE)),\"\"))=0,\"\",(IFERROR((VLOOKUP(Tabla13[[#This Row],[Material]],T_BaseDatos[[Material]:[Factor de resistencia a la\ndifusión del vapor de agua]],3,FALSE)),\"\")))","v":""},{"$f":"IF((IFERROR((IF((VLOOKUP(Tabla13[[#This Row],[Material]],T_BaseDatos[[Material]:[Factor de resistencia a la\ndifusión del vapor de agua]],4,FALSE))=0,(Tabla13[[#This Row],[Espesor de cálculo\n(m)]]/Tabla13[[#This Row],[Conductividad térmica\n(W/mK)]]),(VLOOKUP(Tabla13[[#This Row],[Material]],T_BaseDatos[[Material]:[Factor de resistencia a la\ndifusión del vapor de agua]],4,FALSE)))),\"\"))=0,\"\",(IFERROR((IF((VLOOKUP(Tabla13[[#This Row],[Material]],T_BaseDatos[[Material]:[Factor de resistencia a la\ndifusión del vapor de agua]],4,FALSE))=0,(Tabla13[[#This Row],[Espesor de cálculo\n(m)]]/Tabla13[[#This Row],[Conductividad térmica\n(W/mK)]]),(VLOOKUP(Tabla13[[#This Row],[Material]],T_BaseDatos[[Material]:[Factor de resistencia a la\ndifusión del vapor de agua]],4,FALSE)))),\"\")))","v":""}]
[null,null,null,null,null,{"$f":"IF((IFERROR((IF((VLOOKUP(Tabla13[[#This Row],[Material]],T_BaseDatos[[Material]:[Factor de resistencia a la\ndifusión del vapor de agua]],2,FALSE))=0,Tabla13[[#This Row],[Espesor\n(m)]],(VLOOKUP(Tabla13[[#This Row],[Material]],T_BaseDatos[[Material]:[Factor de resistencia a la\ndifusión del vapor de agua]],2,FALSE)))),\"\"))=0,\"\",(IFERROR((IF((VLOOKUP(Tabla13[[#This Row],[Material]],T_BaseDatos[[Material]:[Factor de resistencia a la\ndifusión del vapor de agua]],2,FALSE))=0,Tabla13[[#This Row],[Espesor\n(m)]],(VLOOKUP(Tabla13[[#This Row],[Material]],T_BaseDatos[[Material]:[Factor de resistencia a la\ndifusión del vapor de agua]],2,FALSE)))),\"\")))","v":""},{"$f":"IF((IFERROR((VLOOKUP(Tabla13[[#This Row],[Material]],T_BaseDatos[[Material]:[Factor de resistencia a la\ndifusión del vapor de agua]],3,FALSE)),\"\"))=0,\"\",(IFERROR((VLOOKUP(Tabla13[[#This Row],[Material]],T_BaseDatos[[Material]:[Factor de resistencia a la\ndifusión del vapor de agua]],3,FALSE)),\"\")))","v":""},{"$f":"IF((IFERROR((IF((VLOOKUP(Tabla13[[#This Row],[Material]],T_BaseDatos[[Material]:[Factor de resistencia a la\ndifusión del vapor de agua]],4,FALSE))=0,(Tabla13[[#This Row],[Espesor de cálculo\n(m)]]/Tabla13[[#This Row],[Conductividad térmica\n(W/mK)]]),(VLOOKUP(Tabla13[[#This Row],[Material]],T_BaseDatos[[Material]:[Factor de resistencia a la\ndifusión del vapor de agua]],4,FALSE)))),\"\"))=0,\"\",(IFERROR((IF((VLOOKUP(Tabla13[[#This Row],[Material]],T_BaseDatos[[Material]:[Factor de resistencia a la\ndifusión del vapor de agua]],4,FALSE))=0,(Tabla13[[#This Row],[Espesor de cálculo\n(m)]]/Tabla13[[#This Row],[Conductividad térmica\n(W/mK)]]),(VLOOKUP(Tabla13[[#This Row],[Material]],T_BaseDatos[[Material]:[Factor de resistencia a la\ndifusión del vapor de agua]],4,FALSE)))),\"\")))","v":""}]
[null,null,null,null,null,{"$f":"IF((IFERROR((IF((VLOOKUP(Tabla13[[#This Row],[Material]],T_BaseDatos[[Material]:[Factor de resistencia a la\ndifusión del vapor de agua]],2,FALSE))=0,Tabla13[[#This Row],[Espesor\n(m)]],(VLOOKUP(Tabla13[[#This Row],[Material]],T_BaseDatos[[Material]:[Factor de resistencia a la\ndifusión del vapor de agua]],2,FALSE)))),\"\"))=0,\"\",(IFERROR((IF((VLOOKUP(Tabla13[[#This Row],[Material]],T_BaseDatos[[Material]:[Factor de resistencia a la\ndifusión del vapor de agua]],2,FALSE))=0,Tabla13[[#This Row],[Espesor\n(m)]],(VLOOKUP(Tabla13[[#This Row],[Material]],T_BaseDatos[[Material]:[Factor de resistencia a la\ndifusión del vapor de agua]],2,FALSE)))),\"\")))","v":""},{"$f":"IF((IFERROR((VLOOKUP(Tabla13[[#This Row],[Material]],T_BaseDatos[[Material]:[Factor de resistencia a la\ndifusión del vapor de agua]],3,FALSE)),\"\"))=0,\"\",(IFERROR((VLOOKUP(Tabla13[[#This Row],[Material]],T_BaseDatos[[Material]:[Factor de resistencia a la\ndifusión del vapor de agua]],3,FALSE)),\"\")))","v":""},{"$f":"IF((IFERROR((IF((VLOOKUP(Tabla13[[#This Row],[Material]],T_BaseDatos[[Material]:[Factor de resistencia a la\ndifusión del vapor de agua]],4,FALSE))=0,(Tabla13[[#This Row],[Espesor de cálculo\n(m)]]/Tabla13[[#This Row],[Conductividad térmica\n(W/mK)]]),(VLOOKUP(Tabla13[[#This Row],[Material]],T_BaseDatos[[Material]:[Factor de resistencia a la\ndifusión del vapor de agua]],4,FALSE)))),\"\"))=0,\"\",(IFERROR((IF((VLOOKUP(Tabla13[[#This Row],[Material]],T_BaseDatos[[Material]:[Factor de resistencia a la\ndifusión del vapor de agua]],4,FALSE))=0,(Tabla13[[#This Row],[Espesor de cálculo\n(m)]]/Tabla13[[#This Row],[Conductividad térmica\n(W/mK)]]),(VLOOKUP(Tabla13[[#This Row],[Material]],T_BaseDatos[[Material]:[Factor de resistencia a la\ndifusión del vapor de agua]],4,FALSE)))),\"\")))","v":""}]
[null,null,null,null,null,{"$f":"IF((IFERROR((IF((VLOOKUP(Tabla13[[#This Row],[Material]],T_BaseDatos[[Material]:[Factor de resistencia a la\ndifusión del vapor de agua]],2,FALSE))=0,Tabla13[[#This Row],[Espesor\n(m)]],(VLOOKUP(Tabla13[[#This Row],[Material]],T_BaseDatos[[Material]:[Factor de resistencia a la\ndifusión del vapor de agua]],2,FALSE)))),\"\"))=0,\"\",(IFERROR((IF((VLOOKUP(Tabla13[[#This Row],[Material]],T_BaseDatos[[Material]:[Factor de resistencia a la\ndifusión del vapor de agua]],2,FALSE))=0,Tabla13[[#This Row],[Espesor\n(m)]],(VLOOKUP(Tabla13[[#This Row],[Material]],T_BaseDatos[[Material]:[Factor de resistencia a la\ndifusión del vapor de agua]],2,FALSE)))),\"\")))","v":""},{"$f":"IF((IFERROR((VLOOKUP(Tabla13[[#This Row],[Material]],T_BaseDatos[[Material]:[Factor de resistencia a la\ndifusión del vapor de agua]],3,FALSE)),\"\"))=0,\"\",(IFERROR((VLOOKUP(Tabla13[[#This Row],[Material]],T_BaseDatos[[Material]:[Factor de resistencia a la\ndifusión del vapor de agua]],3,FALSE)),\"\")))","v":""},{"$f":"IF((IFERROR((IF((VLOOKUP(Tabla13[[#This Row],[Material]],T_BaseDatos[[Material]:[Factor de resistencia a la\ndifusión del vapor de agua]],4,FALSE))=0,(Tabla13[[#This Row],[Espesor de cálculo\n(m)]]/Tabla13[[#This Row],[Conductividad térmica\n(W/mK)]]),(VLOOKUP(Tabla13[[#This Row],[Material]],T_BaseDatos[[Material]:[Factor de resistencia a la\ndifusión del vapor de agua]],4,FALSE)))),\"\"))=0,\"\",(IFERROR((IF((VLOOKUP(Tabla13[[#This Row],[Material]],T_BaseDatos[[Material]:[Factor de resistencia a la\ndifusión del vapor de agua]],4,FALSE))=0,(Tabla13[[#This Row],[Espesor de cálculo\n(m)]]/Tabla13[[#This Row],[Conductividad térmica\n(W/mK)]]),(VLOOKUP(Tabla13[[#This Row],[Material]],T_BaseDatos[[Material]:[Factor de resistencia a la\ndifusión del vapor de agua]],4,FALSE)))),\"\")))","v":""}]
[null,null,null,null,null,{"$f":"IF((IFERROR((IF((VLOOKUP(Tabla13[[#This Row],[Material]],T_BaseDatos[[Material]:[Factor de resistencia a la\ndifusión del vapor de agua]],2,FALSE))=0,Tabla13[[#This Row],[Espesor\n(m)]],(VLOOKUP(Tabla13[[#This Row],[Material]],T_BaseDatos[[Material]:[Factor de resistencia a la\ndifusión del vapor de agua]],2,FALSE)))),\"\"))=0,\"\",(IFERROR((IF((VLOOKUP(Tabla13[[#This Row],[Material]],T_BaseDatos[[Material]:[Factor de resistencia a la\ndifusión del vapor de agua]],2,FALSE))=0,Tabla13[[#This Row],[Espesor\n(m)]],(VLOOKUP(Tabla13[[#This Row],[Material]],T_BaseDatos[[Material]:[Factor de resistencia a la\ndifusión del vapor de agua]],2,FALSE)))),\"\")))","v":""},{"$f":"IF((IFERROR((VLOOKUP(Tabla13[[#This Row],[Material]],T_BaseDatos[[Material]:[Factor de resistencia a la\ndifusión del vapor de agua]],3,FALSE)),\"\"))=0,\"\",(IFERROR((VLOOKUP(Tabla13[[#This Row],[Material]],T_BaseDatos[[Material]:[Factor de resistencia a la\ndifusión del vapor de agua]],3,FALSE)),\"\")))","v":""},{"$f":"IF((IFERROR((IF((VLOOKUP(Tabla13[[#This Row],[Material]],T_BaseDatos[[Material]:[Factor de resistencia a la\ndifusión del vapor de agua]],4,FALSE))=0,(Tabla13[[#This Row],[Espesor de cálculo\n(m)]]/Tabla13[[#This Row],[Conductividad térmica\n(W/mK)]]),(VLOOKUP(Tabla13[[#This Row],[Material]],T_BaseDatos[[Material]:[Factor de resistencia a la\ndifusión del vapor de agua]],4,FALSE)))),\"\"))=0,\"\",(IFERROR((IF((VLOOKUP(Tabla13[[#This Row],[Material]],T_BaseDatos[[Material]:[Factor de resistencia a la\ndifusión del vapor de agua]],4,FALSE))=0,(Tabla13[[#This Row],[Espesor de cálculo\n(m)]]/Tabla13[[#This Row],[Conductividad térmica\n(W/mK)]]),(VLOOKUP(Tabla13[[#This Row],[Material]],T_BaseDatos[[Material]:[Factor de resistencia a la\ndifusión del vapor de agua]],4,FALSE)))),\"\")))","v":""}]
[null,null,null,null,null,{"$f":"IF((IFERROR((IF((VLOOKUP(Tabla13[[#This Row],[Material]],T_BaseDatos[[Material]:[Factor de resistencia a la\ndifusión del vapor de agua]],2,FALSE))=0,Tabla13[[#This Row],[Espesor\n(m)]],(VLOOKUP(Tabla13[[#This Row],[Material]],T_BaseDatos[[Material]:[Factor de resistencia a la\ndifusión del vapor de agua]],2,FALSE)))),\"\"))=0,\"\",(IFERROR((IF((VLOOKUP(Tabla13[[#This Row],[Material]],T_BaseDatos[[Material]:[Factor de resistencia a la\ndifusión del vapor de agua]],2,FALSE))=0,Tabla13[[#This Row],[Espesor\n(m)]],(VLOOKUP(Tabla13[[#This Row],[Material]],T_BaseDatos[[Material]:[Factor de resistencia a la\ndifusión del vapor de agua]],2,FALSE)))),\"\")))","v":""},{"$f":"IF((IFERROR((VLOOKUP(Tabla13[[#This Row],[Material]],T_BaseDatos[[Material]:[Factor de resistencia a la\ndifusión del vapor de agua]],3,FALSE)),\"\"))=0,\"\",(IFERROR((VLOOKUP(Tabla13[[#This Row],[Material]],T_BaseDatos[[Material]:[Factor de resistencia a la\ndifusión del vapor de agua]],3,FALSE)),\"\")))","v":""},{"$f":"IF((IFERROR((IF((VLOOKUP(Tabla13[[#This Row],[Material]],T_BaseDatos[[Material]:[Factor de resistencia a la\ndifusión del vapor de agua]],4,FALSE))=0,(Tabla13[[#This Row],[Espesor de cálculo\n(m)]]/Tabla13[[#This Row],[Conductividad térmica\n(W/mK)]]),(VLOOKUP(Tabla13[[#This Row],[Material]],T_BaseDatos[[Material]:[Factor de resistencia a la\ndifusión del vapor de agua]],4,FALSE)))),\"\"))=0,\"\",(IFERROR((IF((VLOOKUP(Tabla13[[#This Row],[Material]],T_BaseDatos[[Material]:[Factor de resistencia a la\ndifusión del vapor de agua]],4,FALSE))=0,(Tabla13[[#This Row],[Espesor de cálculo\n(m)]]/Tabla13[[#This Row],[Conductividad térmica\n(W/mK)]]),(VLOOKUP(Tabla13[[#This Row],[Material]],T_BaseDatos[[Material]:[Factor de resistencia a la\ndifusión del vapor de agua]],4,FALSE)))),\"\")))","v":""}]
[null,null,null,null,null,{"$f":"IF((IFERROR((IF((VLOOKUP(Tabla13[[#This Row],[Material]],T_BaseDatos[[Material]:[Factor de resistencia a la\ndifusión del vapor de agua]],2,FALSE))=0,Tabla13[[#This Row],[Espesor\n(m)]],(VLOOKUP(Tabla13[[#This Row],[Material]],T_BaseDatos[[Material]:[Factor de resistencia a la\ndifusión del vapor de agua]],2,FALSE)))),\"\"))=0,\"\",(IFERROR((IF((VLOOKUP(Tabla13[[#This Row],[Material]],T_BaseDatos[[Material]:[Factor de resistencia a la\ndifusión del vapor de agua]],2,FALSE))=0,Tabla13[[#This Row],[Espesor\n(m)]],(VLOOKUP(Tabla13[[#This Row],[Material]],T_BaseDatos[[Material]:[Factor de resistencia a la\ndifusión del vapor de agua]],2,FALSE)))),\"\")))","v":""},{"$f":"IF((IFERROR((VLOOKUP(Tabla13[[#This Row],[Material]],T_BaseDatos[[Material]:[Factor de resistencia a la\ndifusión del vapor de agua]],3,FALSE)),\"\"))=0,\"\",(IFERROR((VLOOKUP(Tabla13[[#This Row],[Material]],T_BaseDatos[[Material]:[Factor de resistencia a la\ndifusión del vapor de agua]],3,FALSE)),\"\")))","v":""},{"$f":"IF((IFERROR((IF((VLOOKUP(Tabla13[[#This Row],[Material]],T_BaseDatos[[Material]:[Factor de resistencia a la\ndifusión del vapor de agua]],4,FALSE))=0,(Tabla13[[#This Row],[Espesor de cálculo\n(m)]]/Tabla13[[#This Row],[Conductividad térmica\n(W/mK)]]),(VLOOKUP(Tabla13[[#This Row],[Material]],T_BaseDatos[[Material]:[Factor de resistencia a la\ndifusión del vapor de agua]],4,FALSE)))),\"\"))=0,\"\",(IFERROR((IF((VLOOKUP(Tabla13[[#This Row],[Material]],T_BaseDatos[[Material]:[Factor de resistencia a la\ndifusión del vapor de agua]],4,FALSE))=0,(Tabla13[[#This Row],[Espesor de cálculo\n(m)]]/Tabla13[[#This Row],[Conductividad térmica\n(W/mK)]]),(VLOOKUP(Tabla13[[#This Row],[Material]],T_BaseDatos[[Material]:[Factor de resistencia a la\ndifusión del vapor de agua]],4,FALSE)))),\"\")))","v":""}]
[null,null,null,null,null,{"$f":"IF((IFERROR((IF((VLOOKUP(Tabla13[[#This Row],[Material]],T_BaseDatos[[Material]:[Factor de resistencia a la\ndifusión del vapor de agua]],2,FALSE))=0,Tabla13[[#This Row],[Espesor\n(m)]],(VLOOKUP(Tabla13[[#This Row],[Material]],T_BaseDatos[[Material]:[Factor de resistencia a la\ndifusión del vapor de agua]],2,FALSE)))),\"\"))=0,\"\",(IFERROR((IF((VLOOKUP(Tabla13[[#This Row],[Material]],T_BaseDatos[[Material]:[Factor de resistencia a la\ndifusión del vapor de agua]],2,FALSE))=0,Tabla13[[#This Row],[Espesor\n(m)]],(VLOOKUP(Tabla13[[#This Row],[Material]],T_BaseDatos[[Material]:[Factor de resistencia a la\ndifusión del vapor de agua]],2,FALSE)))),\"\")))","v":""},{"$f":"IF((IFERROR((VLOOKUP(Tabla13[[#This Row],[Material]],T_BaseDatos[[Material]:[Factor de resistencia a la\ndifusión del vapor de agua]],3,FALSE)),\"\"))=0,\"\",(IFERROR((VLOOKUP(Tabla13[[#This Row],[Material]],T_BaseDatos[[Material]:[Factor de resistencia a la\ndifusión del vapor de agua]],3,FALSE)),\"\")))","v":""},{"$f":"IF((IFERROR((IF((VLOOKUP(Tabla13[[#This Row],[Material]],T_BaseDatos[[Material]:[Factor de resistencia a la\ndifusión del vapor de agua]],4,FALSE))=0,(Tabla13[[#This Row],[Espesor de cálculo\n(m)]]/Tabla13[[#This Row],[Conductividad térmica\n(W/mK)]]),(VLOOKUP(Tabla13[[#This Row],[Material]],T_BaseDatos[[Material]:[Factor de resistencia a la\ndifusión del vapor de agua]],4,FALSE)))),\"\"))=0,\"\",(IFERROR((IF((VLOOKUP(Tabla13[[#This Row],[Material]],T_BaseDatos[[Material]:[Factor de resistencia a la\ndifusión del vapor de agua]],4,FALSE))=0,(Tabla13[[#This Row],[Espesor de cálculo\n(m)]]/Tabla13[[#This Row],[Conductividad térmica\n(W/mK)]]),(VLOOKUP(Tabla13[[#This Row],[Material]],T_BaseDatos[[Material]:[Factor de resistencia a la\ndifusión del vapor de agua]],4,FALSE)))),\"\")))","v":""}]
[null,null,null,null,null,{"$f":"IF((IFERROR((IF((VLOOKUP(Tabla13[[#This Row],[Material]],T_BaseDatos[[Material]:[Factor de resistencia a la\ndifusión del vapor de agua]],2,FALSE))=0,Tabla13[[#This Row],[Espesor\n(m)]],(VLOOKUP(Tabla13[[#This Row],[Material]],T_BaseDatos[[Material]:[Factor de resistencia a la\ndifusión del vapor de agua]],2,FALSE)))),\"\"))=0,\"\",(IFERROR((IF((VLOOKUP(Tabla13[[#This Row],[Material]],T_BaseDatos[[Material]:[Factor de resistencia a la\ndifusión del vapor de agua]],2,FALSE))=0,Tabla13[[#This Row],[Espesor\n(m)]],(VLOOKUP(Tabla13[[#This Row],[Material]],T_BaseDatos[[Material]:[Factor de resistencia a la\ndifusión del vapor de agua]],2,FALSE)))),\"\")))","v":""},{"$f":"IF((IFERROR((VLOOKUP(Tabla13[[#This Row],[Material]],T_BaseDatos[[Material]:[Factor de resistencia a la\ndifusión del vapor de agua]],3,FALSE)),\"\"))=0,\"\",(IFERROR((VLOOKUP(Tabla13[[#This Row],[Material]],T_BaseDatos[[Material]:[Factor de resistencia a la\ndifusión del vapor de agua]],3,FALSE)),\"\")))","v":""},{"$f":"IF((IFERROR((IF((VLOOKUP(Tabla13[[#This Row],[Material]],T_BaseDatos[[Material]:[Factor de resistencia a la\ndifusión del vapor de agua]],4,FALSE))=0,(Tabla13[[#This Row],[Espesor de cálculo\n(m)]]/Tabla13[[#This Row],[Conductividad térmica\n(W/mK)]]),(VLOOKUP(Tabla13[[#This Row],[Material]],T_BaseDatos[[Material]:[Factor de resistencia a la\ndifusión del vapor de agua]],4,FALSE)))),\"\"))=0,\"\",(IFERROR((IF((VLOOKUP(Tabla13[[#This Row],[Material]],T_BaseDatos[[Material]:[Factor de resistencia a la\ndifusión del vapor de agua]],4,FALSE))=0,(Tabla13[[#This Row],[Espesor de cálculo\n(m)]]/Tabla13[[#This Row],[Conductividad térmica\n(W/mK)]]),(VLOOKUP(Tabla13[[#This Row],[Material]],T_BaseDatos[[Material]:[Factor de resistencia a la\ndifusión del vapor de agua]],4,FALSE)))),\"\")))","v":""}]
[null,null,null,null,null,{"$f":"IF((IFERROR((IF((VLOOKUP(Tabla13[[#This Row],[Material]],T_BaseDatos[[Material]:[Factor de resistencia a la\ndifusión del vapor de agua]],2,FALSE))=0,Tabla13[[#This Row],[Espesor\n(m)]],(VLOOKUP(Tabla13[[#This Row],[Material]],T_BaseDatos[[Material]:[Factor de resistencia a la\ndifusión del vapor de agua]],2,FALSE)))),\"\"))=0,\"\",(IFERROR((IF((VLOOKUP(Tabla13[[#This Row],[Material]],T_BaseDatos[[Material]:[Factor de resistencia a la\ndifusión del vapor de agua]],2,FALSE))=0,Tabla13[[#This Row],[Espesor\n(m)]],(VLOOKUP(Tabla13[[#This Row],[Material]],T_BaseDatos[[Material]:[Factor de resistencia a la\ndifusión del vapor de agua]],2,FALSE)))),\"\")))","v":""},{"$f":"IF((IFERROR((VLOOKUP(Tabla13[[#This Row],[Material]],T_BaseDatos[[Material]:[Factor de resistencia a la\ndifusión del vapor de agua]],3,FALSE)),\"\"))=0,\"\",(IFERROR((VLOOKUP(Tabla13[[#This Row],[Material]],T_BaseDatos[[Material]:[Factor de resistencia a la\ndifusión del vapor de agua]],3,FALSE)),\"\")))","v":""},{"$f":"IF((IFERROR((IF((VLOOKUP(Tabla13[[#This Row],[Material]],T_BaseDatos[[Material]:[Factor de resistencia a la\ndifusión del vapor de agua]],4,FALSE))=0,(Tabla13[[#This Row],[Espesor de cálculo\n(m)]]/Tabla13[[#This Row],[Conductividad térmica\n(W/mK)]]),(VLOOKUP(Tabla13[[#This Row],[Material]],T_BaseDatos[[Material]:[Factor de resistencia a la\ndifusión del vapor de agua]],4,FALSE)))),\"\"))=0,\"\",(IFERROR((IF((VLOOKUP(Tabla13[[#This Row],[Material]],T_BaseDatos[[Material]:[Factor de resistencia a la\ndifusión del vapor de agua]],4,FALSE))=0,(Tabla13[[#This Row],[Espesor de cálculo\n(m)]]/Tabla13[[#This Row],[Conductividad térmica\n(W/mK)]]),(VLOOKUP(Tabla13[[#This Row],[Material]],T_BaseDatos[[Material]:[Factor de resistencia a la\ndifusión del vapor de agua]],4,FALSE)))),\"\")))","v":""}]
[null,null,null,null,null,{"$f":"IF((IFERROR((IF((VLOOKUP(Tabla13[[#This Row],[Material]],T_BaseDatos[[Material]:[Factor de resistencia a la\ndifusión del vapor de agua]],2,FALSE))=0,Tabla13[[#This Row],[Espesor\n(m)]],(VLOOKUP(Tabla13[[#This Row],[Material]],T_BaseDatos[[Material]:[Factor de resistencia a la\ndifusión del vapor de agua]],2,FALSE)))),\"\"))=0,\"\",(IFERROR((IF((VLOOKUP(Tabla13[[#This Row],[Material]],T_BaseDatos[[Material]:[Factor de resistencia a la\ndifusión del vapor de agua]],2,FALSE))=0,Tabla13[[#This Row],[Espesor\n(m)]],(VLOOKUP(Tabla13[[#This Row],[Material]],T_BaseDatos[[Material]:[Factor de resistencia a la\ndifusión del vapor de agua]],2,FALSE)))),\"\")))","v":""},{"$f":"IF((IFERROR((VLOOKUP(Tabla13[[#This Row],[Material]],T_BaseDatos[[Material]:[Factor de resistencia a la\ndifusión del vapor de agua]],3,FALSE)),\"\"))=0,\"\",(IFERROR((VLOOKUP(Tabla13[[#This Row],[Material]],T_BaseDatos[[Material]:[Factor de resistencia a la\ndifusión del vapor de agua]],3,FALSE)),\"\")))","v":""},{"$f":"IF((IFERROR((IF((VLOOKUP(Tabla13[[#This Row],[Material]],T_BaseDatos[[Material]:[Factor de resistencia a la\ndifusión del vapor de agua]],4,FALSE))=0,(Tabla13[[#This Row],[Espesor de cálculo\n(m)]]/Tabla13[[#This Row],[Conductividad térmica\n(W/mK)]]),(VLOOKUP(Tabla13[[#This Row],[Material]],T_BaseDatos[[Material]:[Factor de resistencia a la\ndifusión del vapor de agua]],4,FALSE)))),\"\"))=0,\"\",(IFERROR((IF((VLOOKUP(Tabla13[[#This Row],[Material]],T_BaseDatos[[Material]:[Factor de resistencia a la\ndifusión del vapor de agua]],4,FALSE))=0,(Tabla13[[#This Row],[Espesor de cálculo\n(m)]]/Tabla13[[#This Row],[Conductividad térmica\n(W/mK)]]),(VLOOKUP(Tabla13[[#This Row],[Material]],T_BaseDatos[[Material]:[Factor de resistencia a la\ndifusión del vapor de agua]],4,FALSE)))),\"\")))","v":""}]
[null,null,null,null,null,{"$f":"IF((IFERROR((IF((VLOOKUP(Tabla13[[#This Row],[Material]],T_BaseDatos[[Material]:[Factor de resistencia a la\ndifusión del vapor de agua]],2,FALSE))=0,Tabla13[[#This Row],[Espesor\n(m)]],(VLOOKUP(Tabla13[[#This Row],[Material]],T_BaseDatos[[Material]:[Factor de resistencia a la\ndifusión del vapor de agua]],2,FALSE)))),\"\"))=0,\"\",(IFERROR((IF((VLOOKUP(Tabla13[[#This Row],[Material]],T_BaseDatos[[Material]:[Factor de resistencia a la\ndifusión del vapor de agua]],2,FALSE))=0,Tabla13[[#This Row],[Espesor\n(m)]],(VLOOKUP(Tabla13[[#This Row],[Material]],T_BaseDatos[[Material]:[Factor de resistencia a la\ndifusión del vapor de agua]],2,FALSE)))),\"\")))","v":""},{"$f":"IF((IFERROR((VLOOKUP(Tabla13[[#This Row],[Material]],T_BaseDatos[[Material]:[Factor de resistencia a la\ndifusión del vapor de agua]],3,FALSE)),\"\"))=0,\"\",(IFERROR((VLOOKUP(Tabla13[[#This Row],[Material]],T_BaseDatos[[Material]:[Factor de resistencia a la\ndifusión del vapor de agua]],3,FALSE)),\"\")))","v":""},{"$f":"IF((IFERROR((IF((VLOOKUP(Tabla13[[#This Row],[Material]],T_BaseDatos[[Material]:[Factor de resistencia a la\ndifusión del vapor de agua]],4,FALSE))=0,(Tabla13[[#This Row],[Espesor de cálculo\n(m)]]/Tabla13[[#This Row],[Conductividad térmica\n(W/mK)]]),(VLOOKUP(Tabla13[[#This Row],[Material]],T_BaseDatos[[Material]:[Factor de resistencia a la\ndifusión del vapor de agua]],4,FALSE)))),\"\"))=0,\"\",(IFERROR((IF((VLOOKUP(Tabla13[[#This Row],[Material]],T_BaseDatos[[Material]:[Factor de resistencia a la\ndifusión del vapor de agua]],4,FALSE))=0,(Tabla13[[#This Row],[Espesor de cálculo\n(m)]]/Tabla13[[#This Row],[Conductividad térmica\n(W/mK)]]),(VLOOKUP(Tabla13[[#This Row],[Material]],T_BaseDatos[[Material]:[Factor de resistencia a la\ndifusión del vapor de agua]],4,FALSE)))),\"\")))","v":""}]
[null,null,null,null,null,{"$f":"IF((IFERROR((IF((VLOOKUP(Tabla13[[#This Row],[Material]],T_BaseDatos[[Material]:[Factor de resistencia a la\ndifusión del vapor de agua]],2,FALSE))=0,Tabla13[[#This Row],[Espesor\n(m)]],(VLOOKUP(Tabla13[[#This Row],[Material]],T_BaseDatos[[Material]:[Factor de resistencia a la\ndifusión del vapor de agua]],2,FALSE)))),\"\"))=0,\"\",(IFERROR((IF((VLOOKUP(Tabla13[[#This Row],[Material]],T_BaseDatos[[Material]:[Factor de resistencia a la\ndifusión del vapor de agua]],2,FALSE))=0,Tabla13[[#This Row],[Espesor\n(m)]],(VLOOKUP(Tabla13[[#This Row],[Material]],T_BaseDatos[[Material]:[Factor de resistencia a la\ndifusión del vapor de agua]],2,FALSE)))),\"\")))","v":""},{"$f":"IF((IFERROR((VLOOKUP(Tabla13[[#This Row],[Material]],T_BaseDatos[[Material]:[Factor de resistencia a la\ndifusión del vapor de agua]],3,FALSE)),\"\"))=0,\"\",(IFERROR((VLOOKUP(Tabla13[[#This Row],[Material]],T_BaseDatos[[Material]:[Factor de resistencia a la\ndifusión del vapor de agua]],3,FALSE)),\"\")))","v":""},{"$f":"IF((IFERROR((IF((VLOOKUP(Tabla13[[#This Row],[Material]],T_BaseDatos[[Material]:[Factor de resistencia a la\ndifusión del vapor de agua]],4,FALSE))=0,(Tabla13[[#This Row],[Espesor de cálculo\n(m)]]/Tabla13[[#This Row],[Conductividad térmica\n(W/mK)]]),(VLOOKUP(Tabla13[[#This Row],[Material]],T_BaseDatos[[Material]:[Factor de resistencia a la\ndifusión del vapor de agua]],4,FALSE)))),\"\"))=0,\"\",(IFERROR((IF((VLOOKUP(Tabla13[[#This Row],[Material]],T_BaseDatos[[Material]:[Factor de resistencia a la\ndifusión del vapor de agua]],4,FALSE))=0,(Tabla13[[#This Row],[Espesor de cálculo\n(m)]]/Tabla13[[#This Row],[Conductividad térmica\n(W/mK)]]),(VLOOKUP(Tabla13[[#This Row],[Material]],T_BaseDatos[[Material]:[Factor de resistencia a la\ndifusión del vapor de agua]],4,FALSE)))),\"\")))","v":""}]
[null,null,null,null,null,{"$f":"IF((IFERROR((IF((VLOOKUP(Tabla13[[#This Row],[Material]],T_BaseDatos[[Material]:[Factor de resistencia a la\ndifusión del vapor de agua]],2,FALSE))=0,Tabla13[[#This Row],[Espesor\n(m)]],(VLOOKUP(Tabla13[[#This Row],[Material]],T_BaseDatos[[Material]:[Factor de resistencia a la\ndifusión del vapor de agua]],2,FALSE)))),\"\"))=0,\"\",(IFERROR((IF((VLOOKUP(Tabla13[[#This Row],[Material]],T_BaseDatos[[Material]:[Factor de resistencia a la\ndifusión del vapor de agua]],2,FALSE))=0,Tabla13[[#This Row],[Espesor\n(m)]],(VLOOKUP(Tabla13[[#This Row],[Material]],T_BaseDatos[[Material]:[Factor de resistencia a la\ndifusión del vapor de agua]],2,FALSE)))),\"\")))","v":""},{"$f":"IF((IFERROR((VLOOKUP(Tabla13[[#This Row],[Material]],T_BaseDatos[[Material]:[Factor de resistencia a la\ndifusión del vapor de agua]],3,FALSE)),\"\"))=0,\"\",(IFERROR((VLOOKUP(Tabla13[[#This Row],[Material]],T_BaseDatos[[Material]:[Factor de resistencia a la\ndifusión del vapor de agua]],3,FALSE)),\"\")))","v":""},{"$f":"IF((IFERROR((IF((VLOOKUP(Tabla13[[#This Row],[Material]],T_BaseDatos[[Material]:[Factor de resistencia a la\ndifusión del vapor de agua]],4,FALSE))=0,(Tabla13[[#This Row],[Espesor de cálculo\n(m)]]/Tabla13[[#This Row],[Conductividad térmica\n(W/mK)]]),(VLOOKUP(Tabla13[[#This Row],[Material]],T_BaseDatos[[Material]:[Factor de resistencia a la\ndifusión del vapor de agua]],4,FALSE)))),\"\"))=0,\"\",(IFERROR((IF((VLOOKUP(Tabla13[[#This Row],[Material]],T_BaseDatos[[Material]:[Factor de resistencia a la\ndifusión del vapor de agua]],4,FALSE))=0,(Tabla13[[#This Row],[Espesor de cálculo\n(m)]]/Tabla13[[#This Row],[Conductividad térmica\n(W/mK)]]),(VLOOKUP(Tabla13[[#This Row],[Material]],T_BaseDatos[[Material]:[Factor de resistencia a la\ndifusión del vapor de agua]],4,FALSE)))),\"\")))","v":""}]
[null,null,null,null,null,{"$f":"IF((IFERROR((IF((VLOOKUP(Tabla13[[#This Row],[Material]],T_BaseDatos[[Material]:[Factor de resistencia a la\ndifusión del vapor de agua]],2,FALSE))=0,Tabla13[[#This Row],[Espesor\n(m)]],(VLOOKUP(Tabla13[[#This Row],[Material]],T_BaseDatos[[Material]:[Factor de resistencia a la\ndifusión del vapor de agua]],2,FALSE)))),\"\"))=0,\"\",(IFERROR((IF((VLOOKUP(Tabla13[[#This Row],[Material]],T_BaseDatos[[Material]:[Factor de resistencia a la\ndifusión del vapor de agua]],2,FALSE))=0,Tabla13[[#This Row],[Espesor\n(m)]],(VLOOKUP(Tabla13[[#This Row],[Material]],T_BaseDatos[[Material]:[Factor de resistencia a la\ndifusión del vapor de agua]],2,FALSE)))),\"\")))","v":""},{"$f":"IF((IFERROR((VLOOKUP(Tabla13[[#This Row],[Material]],T_BaseDatos[[Material]:[Factor de resistencia a la\ndifusión del vapor de agua]],3,FALSE)),\"\"))=0,\"\",(IFERROR((VLOOKUP(Tabla13[[#This Row],[Material]],T_BaseDatos[[Material]:[Factor de resistencia a la\ndifusión del vapor de agua]],3,FALSE)),\"\")))","v":""},{"$f":"IF((IFERROR((IF((VLOOKUP(Tabla13[[#This Row],[Material]],T_BaseDatos[[Material]:[Factor de resistencia a la\ndifusión del vapor de agua]],4,FALSE))=0,(Tabla13[[#This Row],[Espesor de cálculo\n(m)]]/Tabla13[[#This Row],[Conductividad térmica\n(W/mK)]]),(VLOOKUP(Tabla13[[#This Row],[Material]],T_BaseDatos[[Material]:[Factor de resistencia a la\ndifusión del vapor de agua]],4,FALSE)))),\"\"))=0,\"\",(IFERROR((IF((VLOOKUP(Tabla13[[#This Row],[Material]],T_BaseDatos[[Material]:[Factor de resistencia a la\ndifusión del vapor de agua]],4,FALSE))=0,(Tabla13[[#This Row],[Espesor de cálculo\n(m)]]/Tabla13[[#This Row],[Conductividad térmica\n(W/mK)]]),(VLOOKUP(Tabla13[[#This Row],[Material]],T_BaseDatos[[Material]:[Factor de resistencia a la\ndifusión del vapor de agua]],4,FALSE)))),\"\")))","v":""}]
[null,null,null,null,null,{"$f":"IF((IFERROR((IF((VLOOKUP(Tabla13[[#This Row],[Material]],T_BaseDatos[[Material]:[Factor de resistencia a la\ndifusión del vapor de agua]],2,FALSE))=0,Tabla13[[#This Row],[Espesor\n(m)]],(VLOOKUP(Tabla13[[#This Row],[Material]],T_BaseDatos[[Material]:[Factor de resistencia a la\ndifusión del vapor de agua]],2,FALSE)))),\"\"))=0,\"\",(IFERROR((IF((VLOOKUP(Tabla13[[#This Row],[Material]],T_BaseDatos[[Material]:[Factor de resistencia a la\ndifusión del vapor de agua]],2,FALSE))=0,Tabla13[[#This Row],[Espesor\n(m)]],(VLOOKUP(Tabla13[[#This Row],[Material]],T_BaseDatos[[Material]:[Factor de resistencia a la\ndifusión del vapor de agua]],2,FALSE)))),\"\")))","v":""},{"$f":"IF((IFERROR((VLOOKUP(Tabla13[[#This Row],[Material]],T_BaseDatos[[Material]:[Factor de resistencia a la\ndifusión del vapor de agua]],3,FALSE)),\"\"))=0,\"\",(IFERROR((VLOOKUP(Tabla13[[#This Row],[Material]],T_BaseDatos[[Material]:[Factor de resistencia a la\ndifusión del vapor de agua]],3,FALSE)),\"\")))","v":""},{"$f":"IF((IFERROR((IF((VLOOKUP(Tabla13[[#This Row],[Material]],T_BaseDatos[[Material]:[Factor de resistencia a la\ndifusión del vapor de agua]],4,FALSE))=0,(Tabla13[[#This Row],[Espesor de cálculo\n(m)]]/Tabla13[[#This Row],[Conductividad térmica\n(W/mK)]]),(VLOOKUP(Tabla13[[#This Row],[Material]],T_BaseDatos[[Material]:[Factor de resistencia a la\ndifusión del vapor de agua]],4,FALSE)))),\"\"))=0,\"\",(IFERROR((IF((VLOOKUP(Tabla13[[#This Row],[Material]],T_BaseDatos[[Material]:[Factor de resistencia a la\ndifusión del vapor de agua]],4,FALSE))=0,(Tabla13[[#This Row],[Espesor de cálculo\n(m)]]/Tabla13[[#This Row],[Conductividad térmica\n(W/mK)]]),(VLOOKUP(Tabla13[[#This Row],[Material]],T_BaseDatos[[Material]:[Factor de resistencia a la\ndifusión del vapor de agua]],4,FALSE)))),\"\")))","v":""}]
[null,null,null,null,null,{"$f":"IF((IFERROR((IF((VLOOKUP(Tabla13[[#This Row],[Material]],T_BaseDatos[[Material]:[Factor de resistencia a la\ndifusión del vapor de agua]],2,FALSE))=0,Tabla13[[#This Row],[Espesor\n(m)]],(VLOOKUP(Tabla13[[#This Row],[Material]],T_BaseDatos[[Material]:[Factor de resistencia a la\ndifusión del vapor de agua]],2,FALSE)))),\"\"))=0,\"\",(IFERROR((IF((VLOOKUP(Tabla13[[#This Row],[Material]],T_BaseDatos[[Material]:[Factor de resistencia a la\ndifusión del vapor de agua]],2,FALSE))=0,Tabla13[[#This Row],[Espesor\n(m)]],(VLOOKUP(Tabla13[[#This Row],[Material]],T_BaseDatos[[Material]:[Factor de resistencia a la\ndifusión del vapor de agua]],2,FALSE)))),\"\")))","v":""},{"$f":"IF((IFERROR((VLOOKUP(Tabla13[[#This Row],[Material]],T_BaseDatos[[Material]:[Factor de resistencia a la\ndifusión del vapor de agua]],3,FALSE)),\"\"))=0,\"\",(IFERROR((VLOOKUP(Tabla13[[#This Row],[Material]],T_BaseDatos[[Material]:[Factor de resistencia a la\ndifusión del vapor de agua]],3,FALSE)),\"\")))","v":""},{"$f":"IF((IFERROR((IF((VLOOKUP(Tabla13[[#This Row],[Material]],T_BaseDatos[[Material]:[Factor de resistencia a la\ndifusión del vapor de agua]],4,FALSE))=0,(Tabla13[[#This Row],[Espesor de cálculo\n(m)]]/Tabla13[[#This Row],[Conductividad térmica\n(W/mK)]]),(VLOOKUP(Tabla13[[#This Row],[Material]],T_BaseDatos[[Material]:[Factor de resistencia a la\ndifusión del vapor de agua]],4,FALSE)))),\"\"))=0,\"\",(IFERROR((IF((VLOOKUP(Tabla13[[#This Row],[Material]],T_BaseDatos[[Material]:[Factor de resistencia a la\ndifusión del vapor de agua]],4,FALSE))=0,(Tabla13[[#This Row],[Espesor de cálculo\n(m)]]/Tabla13[[#This Row],[Conductividad térmica\n(W/mK)]]),(VLOOKUP(Tabla13[[#This Row],[Material]],T_BaseDatos[[Material]:[Factor de resistencia a la\ndifusión del vapor de agua]],4,FALSE)))),\"\")))","v":""}]
[null,null,null,null,null,{"$f":"IF((IFERROR((IF((VLOOKUP(Tabla13[[#This Row],[Material]],T_BaseDatos[[Material]:[Factor de resistencia a la\ndifusión del vapor de agua]],2,FALSE))=0,Tabla13[[#This Row],[Espesor\n(m)]],(VLOOKUP(Tabla13[[#This Row],[Material]],T_BaseDatos[[Material]:[Factor de resistencia a la\ndifusión del vapor de agua]],2,FALSE)))),\"\"))=0,\"\",(IFERROR((IF((VLOOKUP(Tabla13[[#This Row],[Material]],T_BaseDatos[[Material]:[Factor de resistencia a la\ndifusión del vapor de agua]],2,FALSE))=0,Tabla13[[#This Row],[Espesor\n(m)]],(VLOOKUP(Tabla13[[#This Row],[Material]],T_BaseDatos[[Material]:[Factor de resistencia a la\ndifusión del vapor de agua]],2,FALSE)))),\"\")))","v":""},{"$f":"IF((IFERROR((VLOOKUP(Tabla13[[#This Row],[Material]],T_BaseDatos[[Material]:[Factor de resistencia a la\ndifusión del vapor de agua]],3,FALSE)),\"\"))=0,\"\",(IFERROR((VLOOKUP(Tabla13[[#This Row],[Material]],T_BaseDatos[[Material]:[Factor de resistencia a la\ndifusión del vapor de agua]],3,FALSE)),\"\")))","v":""},{"$f":"IF((IFERROR((IF((VLOOKUP(Tabla13[[#This Row],[Material]],T_BaseDatos[[Material]:[Factor de resistencia a la\ndifusión del vapor de agua]],4,FALSE))=0,(Tabla13[[#This Row],[Espesor de cálculo\n(m)]]/Tabla13[[#This Row],[Conductividad térmica\n(W/mK)]]),(VLOOKUP(Tabla13[[#This Row],[Material]],T_BaseDatos[[Material]:[Factor de resistencia a la\ndifusión del vapor de agua]],4,FALSE)))),\"\"))=0,\"\",(IFERROR((IF((VLOOKUP(Tabla13[[#This Row],[Material]],T_BaseDatos[[Material]:[Factor de resistencia a la\ndifusión del vapor de agua]],4,FALSE))=0,(Tabla13[[#This Row],[Espesor de cálculo\n(m)]]/Tabla13[[#This Row],[Conductividad térmica\n(W/mK)]]),(VLOOKUP(Tabla13[[#This Row],[Material]],T_BaseDatos[[Material]:[Factor de resistencia a la\ndifusión del vapor de agua]],4,FALSE)))),\"\")))","v":""}]
[null,null,null,null,null,{"$f":"IF((IFERROR((IF((VLOOKUP(Tabla13[[#This Row],[Material]],T_BaseDatos[[Material]:[Factor de resistencia a la\ndifusión del vapor de agua]],2,FALSE))=0,Tabla13[[#This Row],[Espesor\n(m)]],(VLOOKUP(Tabla13[[#This Row],[Material]],T_BaseDatos[[Material]:[Factor de resistencia a la\ndifusión del vapor de agua]],2,FALSE)))),\"\"))=0,\"\",(IFERROR((IF((VLOOKUP(Tabla13[[#This Row],[Material]],T_BaseDatos[[Material]:[Factor de resistencia a la\ndifusión del vapor de agua]],2,FALSE))=0,Tabla13[[#This Row],[Espesor\n(m)]],(VLOOKUP(Tabla13[[#This Row],[Material]],T_BaseDatos[[Material]:[Factor de resistencia a la\ndifusión del vapor de agua]],2,FALSE)))),\"\")))","v":""},{"$f":"IF((IFERROR((VLOOKUP(Tabla13[[#This Row],[Material]],T_BaseDatos[[Material]:[Factor de resistencia a la\ndifusión del vapor de agua]],3,FALSE)),\"\"))=0,\"\",(IFERROR((VLOOKUP(Tabla13[[#This Row],[Material]],T_BaseDatos[[Material]:[Factor de resistencia a la\ndifusión del vapor de agua]],3,FALSE)),\"\")))","v":""},{"$f":"IF((IFERROR((IF((VLOOKUP(Tabla13[[#This Row],[Material]],T_BaseDatos[[Material]:[Factor de resistencia a la\ndifusión del vapor de agua]],4,FALSE))=0,(Tabla13[[#This Row],[Espesor de cálculo\n(m)]]/Tabla13[[#This Row],[Conductividad térmica\n(W/mK)]]),(VLOOKUP(Tabla13[[#This Row],[Material]],T_BaseDatos[[Material]:[Factor de resistencia a la\ndifusión del vapor de agua]],4,FALSE)))),\"\"))=0,\"\",(IFERROR((IF((VLOOKUP(Tabla13[[#This Row],[Material]],T_BaseDatos[[Material]:[Factor de resistencia a la\ndifusión del vapor de agua]],4,FALSE))=0,(Tabla13[[#This Row],[Espesor de cálculo\n(m)]]/Tabla13[[#This Row],[Conductividad térmica\n(W/mK)]]),(VLOOKUP(Tabla13[[#This Row],[Material]],T_BaseDatos[[Material]:[Factor de resistencia a la\ndifusión del vapor de agua]],4,FALSE)))),\"\")))","v":""}]
[null,null,null,null,null,{"$f":"IF((IFERROR((IF((VLOOKUP(Tabla13[[#This Row],[Material]],T_BaseDatos[[Material]:[Factor de resistencia a la\ndifusión del vapor de agua]],2,FALSE))=0,Tabla13[[#This Row],[Espesor\n(m)]],(VLOOKUP(Tabla13[[#This Row],[Material]],T_BaseDatos[[Material]:[Factor de resistencia a la\ndifusión del vapor de agua]],2,FALSE)))),\"\"))=0,\"\",(IFERROR((IF((VLOOKUP(Tabla13[[#This Row],[Material]],T_BaseDatos[[Material]:[Factor de resistencia a la\ndifusión del vapor de agua]],2,FALSE))=0,Tabla13[[#This Row],[Espesor\n(m)]],(VLOOKUP(Tabla13[[#This Row],[Material]],T_BaseDatos[[Material]:[Factor de resistencia a la\ndifusión del vapor de agua]],2,FALSE)))),\"\")))","v":""},{"$f":"IF((IFERROR((VLOOKUP(Tabla13[[#This Row],[Material]],T_BaseDatos[[Material]:[Factor de resistencia a la\ndifusión del vapor de agua]],3,FALSE)),\"\"))=0,\"\",(IFERROR((VLOOKUP(Tabla13[[#This Row],[Material]],T_BaseDatos[[Material]:[Factor de resistencia a la\ndifusión del vapor de agua]],3,FALSE)),\"\")))","v":""},{"$f":"IF((IFERROR((IF((VLOOKUP(Tabla13[[#This Row],[Material]],T_BaseDatos[[Material]:[Factor de resistencia a la\ndifusión del vapor de agua]],4,FALSE))=0,(Tabla13[[#This Row],[Espesor de cálculo\n(m)]]/Tabla13[[#This Row],[Conductividad térmica\n(W/mK)]]),(VLOOKUP(Tabla13[[#This Row],[Material]],T_BaseDatos[[Material]:[Factor de resistencia a la\ndifusión del vapor de agua]],4,FALSE)))),\"\"))=0,\"\",(IFERROR((IF((VLOOKUP(Tabla13[[#This Row],[Material]],T_BaseDatos[[Material]:[Factor de resistencia a la\ndifusión del vapor de agua]],4,FALSE))=0,(Tabla13[[#This Row],[Espesor de cálculo\n(m)]]/Tabla13[[#This Row],[Conductividad térmica\n(W/mK)]]),(VLOOKUP(Tabla13[[#This Row],[Material]],T_BaseDatos[[Material]:[Factor de resistencia a la\ndifusión del vapor de agua]],4,FALSE)))),\"\")))","v":""}]

{"sheet":"Datos necesarios","index":1,"n_rows":35,"n_cols":18,"rows_kept":35,"cut":false,"hidden":false,"merged":[[30,12,32,18],[27,5,27,7],[30,2,32,8],[19,12,21,18],[2,2,4,8],[2,12,2,18],[15,14,15,17],[12,5,12,7],[15,2,17,8]]}
[]
[]
[null,null,"DATOS NECESARIOS PARA EL CÁLCULO DE UN\nCERRAMIENTO EN CONTACTO CON ESPACIO NO HABITABLE",null,null,null,null,null,null,null,null,null,"COMPROBACIÓN DE TIPO DE SUELO A EFECTOS DE CÁLCULO"]
[]
[]
[]
[null,null,"Superficie entre espacio habitable y no habitable (m²)"]
[]
[null,null,"Superficie entre espacio no habitable y el exterior (m²)"]
[null,null,null,null,null,null,null,null,null,null,null,null,null,null,null,null,null,"Altura \"h\" (m)"]
[null,null,"Nivel de estanqueidad del espacio no habitable"]
[]
[null,null,"Posición del aislamiento",null,null,null,null,null,null,null,null,null,null,null,null,null,null,"Profundidad \"z\" (m)"]
[]
[]
[null,null,"DATOS NECESARIOS PARA EL CÁLCULO DE UN\nSUELO EN CONTACTO CON EL TERRENO",null,null,null,null,null,null,null,null,null,null,"Método de cálculo",{"$f":"IF((AND(R11=0,R14=0)),\"\",IF((AND(R11<=1,R14<=0.5)),Auxiliar!T10,IF((AND(R11>1,R14<=0.5)),Auxiliar!T6,IF((R14>0.5),Auxiliar!T9,))))","v":""}]
[]
[]
[]
[null,null,"Área del suelo en contacto (m²)",null,null,null,null,null,null,null,null,null,"DATOS NECESARIOS PARA EL CÁLCULO DE UN\nSUELO EN CONTACTO CON CÁMARA SANITARIA"]
[]
[null,null,"Perímetro expuesto  (m)"]
[]
[null,null,"Longitud característica B'",null,null,null,null,{"$f":"IFERROR((H20/(0.5*H22)),\"\")","v":""},null,null,null,null,"Área del suelo en contacto (m²)"]
[]
[null,null,"Profundidad del apoyo respecto el nivel del terreno (m)",null,null,null,null,null,null,null,null,null,"Perímetro expuesto  (m)"]
[]
[null,null,"Tipo de aislamiento",null,null,null,null,null,null,null,null,null,"Longitud característica B'",null,null,null,null,{"$f":"IFERROR((R24/(0.5*R26)),\"\")","v":""}]
[]
[]
[null,null,"DATOS NECESARIOS PARA EL CÁLCULO DE UNA\nCUBIERTA ENTERRADA",null,null,null,null,null,null,null,null,null,"DATOS NECESARIOS PARA EL CÁLCULO DE UN\nMURO EN CONTACTO CON EL TERRENO"]
[]
[]
[]
[null,null,"Espesor de terreno por encima de la cubierta (m)",null,null,null,null,null,null,null,null,null,"Profundidad de la parte enterrada del muro (m)"]

{"sheet":"Resultados","index":2,"n_rows":40,"n_cols":30,"rows_kept":40,"cut":false,"hidden":false,"merged":[[39,22,41,26],[28,22,35,29],[39,27,41,29],[22,2,26,5],[22,6,26,8],[22,12,26,15],[22,16,26,18],[26,22,26,23],[23,22,23,24],[23,26,23,28],[2,22,4,29],[6,22,6,23],[8,22,8,23],[8,24,8,25],[6,29,7,29],[6,26,7,28],[11,22,11,23],[15,22,15,24],[15,26,15,28],[17,22,17,24],[13,22,13,24],[21,26,21,28],[21,22,21,24],[20,12,21,15],[2,2,4,8],[19,11,19,19],[13,26,13,28],[17,26,17,28],[19,26,19,28],[19,22,19,24],[20,16,21,18],[5,2,11,8],[17,1,17,9],[16,1,16,9],[20,2,21,5],[19,1,19,9],[20,6,21,8]]}
[]
[]
[null,null,"Tipo de cerramiento calculado",null,null,null,null,null,null,null,null,null,null,null,null,null,null,null,null,null,null,null,"Bases de cálculo"]
[]
[]
[null,null,{"$f":"IF(Cerramiento!D3=0,\"\",Cerramiento!D3)","v":""}]
[null,null,null,null,null,null,null,null,null,null,null,null,null,null,null,null,null,null,null,null,null,null,"Tipo de cerramiento:",null,{"$f":"IFERROR((HLOOKUP(Cerramiento!D3,Auxiliar!$AN$3:$AW$17,2,FALSE)),\"\")","v":""},null,"Apartado del DA DB-HE/1 aplicado para el método de cálculo:",null,null,{"$f":"IFERROR((HLOOKUP(Cerramiento!D3,Auxiliar!$AN$3:$AW$17,4,FALSE)),\"\")","v":""}]
[]
[null,null,null,null,null,null,null,null,null,null,null,null,null,null,null,null,null,null,null,null,null,null,"En contacto con:",null,{"$f":"IFERROR((HLOOKUP(Cerramiento!D3,Auxiliar!$AN$3:$AW$17,3,FALSE)),\"\")","v":""}]
[]
[]
[null,null,null,null,null,null,null,null,null,null,null,null,null,null,null,null,null,null,null,null,null,null,"Datos necesarios:"]
[]
[null,null,null,null,null,null,null,null,null,null,null,null,null,null,null,null,null,null,null,null,null,null,{"$f":"IF(Cerramiento!D3=0,\"\",\"Rse (m²K/W)\")","v":""},null,null,{"$f":"IFERROR((VLOOKUP(Cerramiento!D3,Auxiliar!$T$4:$W$13,3,FALSE)),\"\")","v":""},{"$f":"IF(Cerramiento!D3=0,\"\",\"Rsi (m²K/W)\")","v":""},null,null,{"$f":"IFERROR((VLOOKUP(Cerramiento!D3,Auxiliar!$T$4:$W$13,4,FALSE)),\"\")","v":""}]
[]
[null,null,null,null,null,null,null,null,null,null,null,null,null,null,null,null,null,null,null,null,null,null,{"$f":"IFERROR((HLOOKUP(Cerramiento!D3,Auxiliar!$AN$3:$AW$17,5,FALSE)),\"\")","v":""},null,null,{"$f":"IFERROR((HLOOKUP(Cerramiento!D3,Auxiliar!AZ3:BI15,5,FALSE)),\"\")","v":""},{"$f":"IFERROR((HLOOKUP(Cerramiento!D3,Auxiliar!$AN$3:$AW$17,6,FALSE)),\"\")","v":""},null,null,{"$f":"IFERROR((HLOOKUP(Cerramiento!D3,Auxiliar!AZ3:BI15,6,FALSE)),\"\")","v":""}]
[null,"Actualización: Noviembre 2022"]
[null,"José Carlos Merino Izquierdo",null,null,null,null,null,null,null,null,null,null,null,null,null,null,null,null,null,null,null,null,{"$f":"IFERROR((IF((HLOOKUP(Cerramiento!D3,Auxiliar!$AN$3:$AW$17,7,FALSE))=0,\"\",(HLOOKUP(Cerramiento!D3,Auxiliar!$AN$3:$AW$17,7,FALSE)))),\"\")","v":""},null,null,{"$f":"IFERROR((IF((HLOOKUP(Cerramiento!D3,Auxiliar!AZ3:BI15,7,FALSE))=0,\"\",(HLOOKUP(Cerramiento!D3,Auxiliar!AZ3:BI15,7,FALSE)))),\"\")","v":""},{"$f":"IFERROR((IF((HLOOKUP(Cerramiento!D3,Auxiliar!$AN$3:$AW$17,11,FALSE))=0,\"\",(HLOOKUP(Cerramiento!D3,Auxiliar!$AN$3:$AW$17,11,FALSE)))),\"\")","v":""},null,null,{"$f":"IFERROR((IF((HLOOKUP(Cerramiento!D3,Auxiliar!AZ3:BI15,11,FALSE))=0,\"\",(HLOOKUP(Cerramiento!D3,Auxiliar!AZ3:BI15,11,FALSE)))),\"\")","v":""}]
[]
[null,{"$f":"Auxiliar!Y32","v":""},null,null,null,null,null,null,null,null,null,{"$f":"IF((SUM(Cerramiento!H37:H58))=0,\"\",Auxiliar!Y33)","v":""},null,null,null,null,null,null,null,null,null,null,{"$f":"IFERROR((IF((HLOOKUP(Cerramiento!D3,Auxiliar!$AN$3:$AW$17,8,FALSE))=0,\"\",(HLOOKUP(Cerramiento!D3,Auxiliar!$AN$3:$AW$17,8,FALSE)))),\"\")","v":""},null,null,{"$f":"IFERROR((IF((HLOOKUP(Cerramiento!D3,Auxiliar!AZ3:BI15,8,FALSE))=0,\"\",(HLOOKUP(Cerramiento!D3,Auxiliar!AZ3:BI15,8,FALSE)))),\"\")","v":""},{"$f":"IFERROR((IF((HLOOKUP(Cerramiento!D3,Auxiliar!$AN$3:$AW$17,12,FALSE))=0,\"\",(HLOOKUP(Cerramiento!D3,Auxiliar!$AN$3:$AW$17,12,FALSE)))),\"\")","v":""},null,null,{"$f":"IFERROR((IF((HLOOKUP(Cerramiento!D3,Auxiliar!AZ3:BI15,12,FALSE))=0,\"\",(HLOOKUP(Cerramiento!D3,Auxiliar!AZ3:BI15,12,FALSE)))),\"\")","v":""}]
[null,null,"Solución de Proyecto",null,null,null,{"$f":"CONCATENATE(\"Espesor total = \",((SUM(Cerramiento!F10:F31))*1000),\" mm\")","v":"Espesor total = 0 mm"},null,null,null,null,null,"Solución Alternativa",null,null,null,{"$f":"CONCATENATE(\"Espesor total = \",((SUM(Cerramiento!F37:F58))*1000),\" mm\")","v":"Espesor total = 0 mm"}]
[null,null,null,null,null,null,null,null,null,null,null,null,null,null,null,null,null,null,null,null,null,null,{"$f":"IFERROR((IF((HLOOKUP(Cerramiento!D3,Auxiliar!$AN$3:$AW$17,9,FALSE))=0,\"\",(HLOOKUP(Cerramiento!D3,Auxiliar!$AN$3:$AW$17,9,FALSE)))),\"\")","v":""},null,null,{"$f":"IFERROR((IF((HLOOKUP(Cerramiento!D3,Auxiliar!AZ3:BI15,9,FALSE))=0,\"\",(HLOOKUP(Cerramiento!D3,Auxiliar!AZ3:BI15,9,FALSE)))),\"\")","v":""},{"$f":"IFERROR((IF((HLOOKUP(Cerramiento!D3,Auxiliar!$AN$3:$AW$17,13,FALSE))=0,\"\",(HLOOKUP(Cerramiento!D3,Auxiliar!$AN$3:$AW$17,13,FALSE)))),\"\")","v":""},null,null,{"$f":"IFERROR((IF((HLOOKUP(Cerramiento!D3,Auxiliar!AZ3:BI15,13,FALSE))=0,\"\",(HLOOKUP(Cerramiento!D3,Auxiliar!AZ3:BI15,13,FALSE)))),\"\")","v":""}]
[null,null,"Transmitancia térmica calculada \"U\"",null,null,null,{"$f":"IF((SUM(Cerramiento!H10:H31))=0,\"Faltan datos\",Auxiliar!AB20)","v":"Faltan datos"},null,null,null,null,null,"Transmitancia térmica calculada \"U\"",null,null,null,{"$f":"IF((SUM(Cerramiento!H37:H58))=0,\"Faltan datos\",Auxiliar!AB23)","v":"Faltan datos"}]
[null,null,null,null,null,null,null,null,null,null,null,null,null,null,null,null,null,null,null,null,null,null,{"$f":"IFERROR((IF((HLOOKUP(Cerramiento!D3,Auxiliar!$AN$3:$AW$17,10,FALSE))=0,\"\",(HLOOKUP(Cerramiento!D3,Auxiliar!$AN$3:$AW$17,10,FALSE)))),\"\")","v":""},null,null,{"$f":"IFERROR((IF((HLOOKUP(Cerramiento!D3,Auxiliar!AZ3:BI15,10,FALSE))=0,\"\",(HLOOKUP(Cerramiento!D3,Auxiliar!AZ3:BI15,10,FALSE)))),\"\")","v":""},{"$f":"IFERROR((IF((HLOOKUP(Cerramiento!D3,Auxiliar!$AN$3:$AW$17,14,FALSE))=0,\"\",(HLOOKUP(Cerramiento!D3,Auxiliar!$AN$3:$AW$17,14,FALSE)))),\"\")","v":""},null,null,{"$f":"IFERROR((IF((HLOOKUP(Cerramiento!D3,Auxiliar!AZ3:BI16,14,FALSE))=0,\"\",(HLOOKUP(Cerramiento!D3,Auxiliar!AZ3:BI16,14,FALSE)))),\"\")","v":""}]
[]
[]
[null,null,null,null,null,null,null,null,null,null,null,null,null,null,null,null,null,null,null,null,null,null,"Comentario adicional:"]
[]
[null,null,null,null,null,null,null,null,null,null,null,null,null,null,null,null,null,null,null,null,null,null,{"$f":"IFERROR((HLOOKUP(Cerramiento!D3,Auxiliar!$AN$3:$AW$17,15,FALSE)),\"\")","v":""}]
[]
[]
[]
[]
[]
[]
[]
[]
[]
[]
[null,null,null,null,null,null,null,null,null,null,null,null,null,null,null,null,null,null,null,null,null,null,"Porcentaje de Mejora\nSolución Alternativa frente a Solución de Proyecto",null,null,null,null,{"$f":"IFERROR('Recop. Datos'!M8,\"-\")","v":"-"}]

{"sheet":"Materiales","index":3,"n_rows":421,"n_cols":8,"rows_kept":421,"cut":false,"hidden":true,"merged":[]}
["Grupo","Material","Espesor\n(m)","Conductividad térmica\n(W/mK)","Resistencia térmica\n(m²K/W)","Densidad\n(Kg/m³)","Calor Específico\n(Cp)","Factor de resistencia a la\ndifusión del vapor de agua"]
["AislamientosValero","EEPS-GrafipolTR0_Valero",null,3.3000000000000002E-2,null,13,1200,30]
["AislamientosValero","EEPS-GrafipolTR0-Impact_Valero",null,3.3000000000000002E-2,null,13,1200,30]
["AislamientosValero","EPS-DonpolAzul_Valero",null,3.3000000000000002E-2,null,26,1200,40]
["AislamientosValero","EPS-DonpolVerdeHidrófobo_Valero",null,3.2000000000000001E-2,null,30,1200,40]
["AislamientosValero","EPS-GrafipolCubInclinadas_Valero",null,2.9000000000000001E-2,null,28,1200,40]
["AislamientosValero","EPS-GrafipolFrenteForjado_Valero",null,3.2000000000000001E-2,null,13,1200,30]
["AislamientosValero","EPS-GrafipolTermoimpact_Valero",null,0.03,null,18,1200,40]
["AislamientosValero","EPS-GrafipolTR29_Valero",null,2.9000000000000001E-2,null,28,1200,40]
["AislamientosValero","EPS-GrafipolTR30_Valero",null,0.03,null,18,1200,40]
["AislamientosValero","EPS-GrafipolTR31_Valero",null,3.1E-2,null,16,1200,40]
["AislamientosValero","EPS-GrafipolTR32_Valero",null,3.2000000000000001E-2,null,13,1200,30]
["AislamientosValero","EPS-GrafipolTR5_Valero",4.2000000000000003E-2,3.2000000000000001E-2,1.25,140,1200,30]
["AislamientosValero","EPS-GrafipolTR-SATE_Valero",null,3.1E-2,null,16,1200,40]
["AislamientosValero","EPS-GVSATE_Valero",null,3.5999999999999997E-2,null,16,1200,40]
["Aislantes","EPS Poliestireno expandido [0,029 W/mK]",null,2.9000000000000001E-2,null,30,1000,20]
["Aislantes","EPS Poliestireno expandido [0,032 W/mK]",null,3.2000000000000001E-2,null,30,1000,20]
["Aislantes","EPS Poliestireno expandido [0,036 W/mK]",null,3.5999999999999997E-2,null,30,1000,20]
["Aislantes","MW Lana mineral [0,032 W/mK]",null,3.2000000000000001E-2,null,40,1000,1]
["Aislantes","MW Lana mineral [0,034 W/mK]",null,3.4000000000000002E-2,null,40,1000,1]
["Aislantes","MW Lana mineral [0,035 W/mK]",null,3.5000000000000003E-2,null,40,1000,1]
["Aislantes","MW Lana mineral [0,036 W/mK]",null,3.5999999999999997E-2,null,40,1000,1]
["Aislantes","MW Lana mineral [0,037 W/mK]",null,3.6999999999999998E-2,null,40,1000,1]
["Aislantes","MW Lana mineral [0,041 W/mK]",null,4.1000000000000002E-2,null,40,1000,1]
["Aislantes","Panel de vidrio celular [CG]",null,4.8000000000000001E-2,null,125,1000,{"$f":"1E+30","v":1E+30}]
["Aislantes","PIR espuma de Poliisocianurato [0,023 W/mK]",null,2.3E-2,null,40,1000,100]
["Aislantes","PIR espuma de Poliisocianurato [0,025 W/mK]",null,2.5000000000000001E-2,null,40,1000,100]
["Aislantes","PUR espuma de Poliuretano [0,028 W/mK]",null,2.8000000000000001E-2,null,35,650,60]
["Aislantes","XPS Poliestireno extruido [0,033 W/mK]",null,3.3000000000000002E-2,null,30,1450,80]
["Aislantes","XPS Poliestireno extruido [0,034 W/mK]",null,3.4000000000000002E-2,null,30,1450,80]
["Aislantes","XPS Poliestireno extruido [0,036 W/mK]",null,3.5999999999999997E-2,null,30,1450,80]
["Aislantes","XPS Poliestireno extruido [0,038 W/mK]",null,3.7999999999999999E-2,null,30,1450,80]
["Bituminosos","Asfalto",null,0.7,null,2100,1000,50000]
["Bituminosos","Asfalto arenoso",null,0.15,null,2100,1000,50000]
["Bituminosos","Betún fieltro o lámina",null,0.23,null,1100,1000,50000]
["Bituminosos","Betún puro",null,0.17,null,1050,1000,50000]
["Bloque_Cerámico","BC con mortero aislante espesor 140 mm",0.14000000000000001,0.32400000000000001,0.432,1020,1000,10]
["Bloque_Cerámico","BC con mortero aislante espesor 190 mm",0.19,0.30599999999999999,0.621,910,1000,10]
["Bloque_Cerámico","BC con mortero aislante espesor 240 mm",0.24,0.29799999999999999,0.80500000000000005,920,1000,10]
["Bloque_Cerámico","BC con mortero aislante espesor 290 mm",0.28999999999999998,0.29499999999999998,0.98299999999999998,910,1000,10]
["Bloque_Cerámico","BC con mortero convencional espesor 140 mm",0.14000000000000001,0.438,0.32,1170,1000,10]
["Bloque_Cerámico","BC con mortero convencional espesor 190 mm",0.19,0.433,0.439,1080,1000,10]
["Bloque_Cerámico","BC con mortero convencional espesor 240 mm",0.24,0.42399999999999999,0.56599999999999995,1090,1000,10]
["Bloque_Cerámico","BC con mortero convencional espesor 290 mm",0.28999999999999998,0.42099999999999999,0.68899999999999995,1080,1000,10]
["Bloque_HormigónAL","BH aligerado hueco espesor 250 mm",0.25,0.47199999999999998,0.53,760,1000,6]
["Bloque_HormigónAL","BH aligerado hueco espesor 300 mm",0.3,0.45400000000000001,0.66100000000000003,1050,1000,6]
["Bloque_HormigónAL","BH aligerado hueco -muro de carga- espesor 300 mm",0.3,0.47499999999999998,0.63200000000000001,1160,1000,6]
["Bloque_HormigónAL","BH aligerado hueco -muro de carga- espesor 300 mm con mortero aligerado",0.3,0.42099999999999999,0.71299999999999997,1100,1000,6]
["Bloque_HormigónAL","BH aligerado macizo con áridos ligeros 140 mm",0.14000000000000001,0.17499999999999999,0.8,1134,1000,6]
["Bloque_HormigónAL","BH aligerado macizo con áridos ligeros 170 mm",0.17,0.309,0.55000000000000004,1450,1000,6]
["Bloque_HormigónAL","BH aligerado macizo con áridos ligeros 240 mm",0.24,0.26400000000000001,0.90900000000000003,900,1000,6]
["Bloque_HormigónAL","BH aligerado macizo con áridos ligeros 290 mm",0.28999999999999998,0.30499999999999999,0.95099999999999996,1050,1000,6]
["Bloque_HormigónAL","BH aligerado macizo con áridos ligeros 290 mm, muro de carga",0.28999999999999998,0.46,0.63,1160,1000,6]
["Bloque_HormigónAL","BH aligerado macizo con áridos ligeros 290 mm, muro de carga con mortero aislante",0.28999999999999998,0.40799999999999997,0.71099999999999997,1100,1000,6]
["Bloque_HormigónAL","BH aligerado macizo espesor 200 mm",0.2,0.28699999999999998,0.69699999999999995,840,1000,6]
["Bloque_HormigónAL","BH aligerado macizo espesor 250 mm",0.25,0.3,0.83299999999999996,850,1000,6]
["Bloque_HormigónAL","BH aligerado macizo espesor 300 mm",0.3,0.317,0.94599999999999995,860,1000,6]
["Bloque_HormigónAL","BH aligerado macizo -muro de carga- espesor 300 mm",0.3,0.33800000000000002,0.88800000000000001,940,1000,6]
["Bloque_HormigónAL","BH aligerado macizo -muro de carga- espesor 300 mm con mortero aligerado",0.3,0.28699999999999998,1.0449999999999999,910,1000,6]
["Bloque_HormigónAL","BH aligerado perforado con áridos ligeros 110 mm",0.11,0.186,0.59099999999999997,1095,1000,6]
["Bloque_HormigónAL","BH aligerado perforado con áridos ligeros 140 mm",0.14000000000000001,0.20599999999999999,0.68,1000,1000,6]
["Bloque_HormigónAL","BH aligerado perforado con áridos ligeros 190 mm",0.19,0.253,0.751,950,1000,6]
["Bloque_HormigónAL","BH aligerado perforado con áridos ligeros 240 mm",0.24,0.28899999999999998,0.83,850,1000,6]
["Bloque_HormigónAL","BH aligerado perforado con áridos ligeros 290 mm",0.28999999999999998,0.30499999999999999,0.95099999999999996,860,1000,6]
["Bloque_HormigónAL","BH aligerado perforado con áridos ligeros 290 mm, muro de carga",0.28999999999999998,0.32600000000000001,0.89,970,1000,6]
["Bloque_HormigónAL","BH aligerado perforado con áridos ligeros 290 mm, muro de carga con mortero aislante",0.28999999999999998,0.27600000000000002,1.0509999999999999,910,1000,6]
["Bloque_HormigónAL","BH aligerado perforado con áridos ligeros 80 mm",0.08,0.17799999999999999,0.44900000000000001,1220,1000,6]
["Bloque_HormigónAL","BH aligerado perforado con áridos ligeros 90 mm",0.09,0.17299999999999999,0.52,1150,1000,6]
["Bloque_HormigónAL","Bloque de picón aligerado de 120 mm con cámara doble",0.12,0.38700000000000001,0.31,900,800,10]
["Bloque_HormigónAL","Bloque de picón aligerado de 150 mm con cámara doble",0.15,0.34899999999999998,0.43,950,800,10]
["Bloque_HormigónAL","Bloque de picón aligerado de 200 mm con cámara doble",0.2,0.41699999999999998,0.48,900,800,10]
["Bloque_HormigónAL","Bloque de picón aligerado de 250 mm con cámara doble",0.25,0.46300000000000002,0.54,800,800,10]
["Bloque_HormigónAL","Bloque de picón aligerado de 250 mm con cámara triple",0.25,0.40300000000000002,0.62,900,800,10]
["Bloque_HormigónAL","Bloque de picón aligerado de 90 mm con cámara simple",0.09,0.33300000000000002,0.27,1000,800,10]
["Bloque_HormigónAL","Bloque de picón de 120 mm con cámara doble",0.12,0.46200000000000002,0.26,1100,800,10]
["Bloque_HormigónAL","Bloque de picón de 150 mm con cámara doble",0.15,0.42899999999999999,0.35,1150,800,10]
["Bloque_HormigónAL","Bloque de picón de 200 mm con cámara doble",0.2,0.5,0.4,1000,800,10]
["Bloque_HormigónAL","Bloque de picón de 250 mm con cámara doble",0.25,0.55600000000000005,0.45,900,800,10]
["Bloque_HormigónAL","Bloque de picón de 250 mm con cámara triple",0.25,0.5,0.5,1000,800,10]
["Bloque_HormigónAL","Bloque de picón de 90 mm con cámara simple",0.09,0.40899999999999997,0.22,1200,800,10]
["Bloque_HormigónCO","BH convencional espesor 100 mm",0.1,0.63200000000000001,0.158,1210,1000,10]
["Bloque_HormigónCO","BH convencional espesor 150 mm",0.15,0.78900000000000003,0.19,1040,1000,10]
["Bloque_HormigónCO","BH convencional espesor 200 mm",0.2,0.92300000000000004,0.217,860,1000,10]
["Bloque_HormigónCO","BH convencional espesor 250 mm",0.25,1.0069999999999999,0.248,685,1000,10]
["Bloque_HormigónCO","BH convencional espesor 300 mm",0.3,1.1599999999999999,0.25900000000000001,585,1000,10]
["Bloque_HormigónCO","BH hueco con áridos densos 110 mm",0.11,0.64700000000000002,0.17,1300,1000,10]
["Bloque_HormigónCO","BH hueco con áridos densos 140 mm",0.14000000000000001,0.73699999999999999,0.19,1200,1000,10]
["Bloque_HormigónCO","BH hueco con áridos densos 190 mm",0.19,0.86399999999999999,0.22,1100,1000,10]
["Bloque_HormigónCO","BH hueco con áridos densos 240 mm",0.24,0.96,0.25,1100,1000,10]
["Bloque_HormigónCO","BH hueco con áridos densos 290 mm",0.28999999999999998,1.115,0.26,1000,1000,10]
["Bloque_HormigónCO","BH hueco con áridos densos 50 mm",0.05,1,0.05,2090,1000,10]
["Bloque_HormigónCO","BH hueco con áridos densos 60 mm",0.06,0.85699999999999998,7.0000000000000007E-2,1552,1000,10]
["Bloque_HormigónCO","BH hueco con áridos densos 80 mm",0.08,0.8,0.1,1514,1000,10]
["Bloque_HormigónCO","BH hueco con áridos densos 90 mm",0.09,0.56299999999999994,0.16,1400,1000,10]
["Cámaras_Aire","Cámara de aire ligeramente ventilada horizontal 1 cm",0.01,null,7.4999999999999997E-2,null,null,1]
["Cámaras_Aire","Cámara de aire ligeramente ventilada horizontal 10 cm",0.1,null,0.09,null,null,1]
["Cámaras_Aire","Cámara de aire ligeramente ventilada horizontal 2 cm",0.02,null,0.08,null,null,1]
["Cámaras_Aire","Cámara de aire ligeramente ventilada horizontal 5 cm",0.05,null,0.08,null,null,1]
["Cámaras_Aire","Cámara de aire ligeramente ventilada vertical 1 cm",0.01,null,7.4999999999999997E-2,null,null,1]
["Cámaras_Aire","Cámara de aire ligeramente ventilada vertical 10 cm",0.1,null,9.5000000000000001E-2,null,null,1]
["Cámaras_Aire","Cámara de aire ligeramente ventilada vertical 2 cm",0.02,null,8.5000000000000006E-2,null,null,1]
["Cámaras_Aire","Cámara de aire ligeramente ventilada vertical 5 cm",0.05,null,0.09,null,null,1]
["Cámaras_Aire","Cámara de aire sin ventilar horizontal 1 cm",0.01,null,0.15,null,null,1]
["Cámaras_Aire","Cámara de aire sin ventilar horizontal 10 cm",0.1,null,0.18,null,null,1]
["Cámaras_Aire","Cámara de aire sin ventilar horizontal 2 cm",0.02,null,0.16,null,null,1]
["Cámaras_Aire","Cámara de aire sin ventilar horizontal 5 cm",0.05,null,0.16,null,null,1]
["Cámaras_Aire","Cámara de aire sin ventilar vertical 1 cm",0.01,null,0.15,null,null,1]
["Cámaras_Aire","Cámara de aire sin ventilar vertical 10 cm",0.1,null,0.19,null,null,1]
["Cámaras_Aire","Cámara de aire sin ventilar vertical 2 cm",0.02,null,0.17,null,null,1]
["Cámaras_Aire","Cámara de aire sin ventilar vertical 5 cm",0.05,null,0.18,null,null,1]
["Cámaras_Aire","Cámara de aire ventilada",null,null,"-",null,null,1]
["Cauchos","Butadieno",null,0.25,null,980,1000,100000]
["Cauchos","Butilo [isobutelo] compacto/colado en aceite",null,0.24,null,1200,1400,200000]
["Cauchos","Caucho celular",null,0.06,null,70,1500,7000]
["Cauchos","Caucho natural",null,0.13,null,910,1100,10000]
["Cauchos","Caucho rígido [ebonita] sólido",null,0.17,null,1200,1400,{"$f":"1E+30","v":1E+30}]
["Cauchos","Etileno propileno dieno monómero [EPDM]",null,0.25,null,1150,1000,6000]
["Cauchos","Neopreno [policloropreno]",null,0.23,null,1240,2140,10000]
["Cauchos","Poliisobutileno",null,0.2,null,930,1100,10000]
["Cauchos","Polisulfuro",null,0.4,null,1700,1000,10000]
["Cerámicos","Azulejo cerámico",null,1.3,null,2300,840,{"$f":"1E+30","v":1E+30}]
["Cerámicos","Gres (sílice) 2200 < d < 2590",null,2.2999999999999998,null,2395,1000,30]
["Cerámicos","Gres calcáreo 2000 < d < 2700",null,1.9,null,2350,1000,20]
["Cerámicos","Gres cuarzoso 2600 < d < 2800",null,2.6,null,2700,1000,30]
["Cerámicos","Plaqueta o baldosa cerámica",null,1,null,2000,800,30]
["Cerámicos","Plaqueta o baldosa de gres",null,2.2999999999999998,null,2500,1000,30]
["Cerámicos","Teja cerámica-porcelana",null,1.3,null,2300,840,30]
["Cerámicos","Teja de arcilla cocida",null,1,null,2000,800,30]
["Enlucidos","Enlucido de yeso 1000 < d < 1300",null,0.56999999999999995,null,1150,1000,6]
["Enlucidos","Enlucido de yeso aislante 500 < d < 600",null,0.18,null,550,1000,6]
["Enlucidos","Enlucido de yeso aislante 600 < d < 900",null,0.3,null,750,1000,6]
["Enlucidos","Enlucido de yeso d < 1000",null,0.4,null,900,1000,6]
["ForjadosRET","FR Entrevigado cerámico - Canto 250 mm",0.25,1.64,0.152,166,1000,10]
["ForjadosRET","FR Entrevigado cerámico - Canto 300 mm",0.3,1.6779999999999999,0.17899999999999999,1580,1000,10]
["ForjadosRET","FR Entrevigado cerámico - Canto 350 mm",0.35,1.7170000000000001,0.20399999999999999,1520,1000,10]
["ForjadosRET","FR Entrevigado de EPS mecanizado enrasado - Canto 250 mm",0.25,1.19,0.21,1280,1000,60]
["ForjadosRET","FR Entrevigado de EPS mecanizado enrasado - Canto 300 mm",0.3,0.66700000000000004,0.45,1470,1000,60]
["ForjadosRET","FR Entrevigado de EPS mecanizado enrasado - Canto 350 mm",0.35,0.70699999999999996,0.495,1420,1000,60]
["ForjadosRET","FR Entrevigado de EPS mecanizado enrasado - Canto 400 mm",0.4,0.74099999999999999,0.54,1390,1000,60]
["ForjadosRET","FR Entrevigado de EPS mecanizado enrasado - Canto 450 mm",0.45,0.76900000000000002,0.58499999999999996,1360,1000,60]
["ForjadosRET","FR Entrevigado de EPS moldeado descolgado - Canto 250 mm",0.25,0.30499999999999999,0.82,1140,1000,60]
["ForjadosRET","FR Entrevigado de EPS moldeado descolgado - Canto 300 mm",0.3,0.35699999999999998,0.84,1330,1000,60]
["ForjadosRET","FR Entrevigado de EPS moldeado descolgado - Canto 350 mm",0.35,0.40200000000000002,0.871,1310,1000,60]
["ForjadosRET","FR Entrevigado de EPS moldeado descolgado - Canto 400 mm",0.4,0.44,0.90900000000000003,1290,1000,60]
["ForjadosRET","FR Entrevigado de EPS moldeado descolgado - Canto 450 mm",0.45,0.47899999999999998,0.93899999999999995,1280,1000,60]
["ForjadosRET","FR Entrevigado de EPS moldeado enrasado - Canto 250 mm",0.25,1.1910000000000001,0.21,1280,1000,60]
["ForjadosRET","FR Entrevigado de EPS moldeado enrasado - Canto 300 mm",0.3,1.056,0.28399999999999997,1460,1000,60]
["ForjadosRET","FR Entrevigado de EPS moldeado enrasado - Canto 350 mm",0.35,1.0649999999999999,0.32900000000000001,1420,1000,60]
["ForjadosRET","FR Entrevigado de EPS moldeado enrasado - Canto 400 mm",0.4,1.073,0.373,1380,1000,60]
["ForjadosRET","FR Entrevigado de EPS moldeado enrasado - Canto 450 mm",0.45,1.079,0.41699999999999998,1360,1000,60]
["ForjadosRET","FR Entrevigado de hormigón - Canto 250 mm",0.25,1.901,0.13200000000000001,1740,1000,10]
["ForjadosRET","FR Entrevigado de hormigón - Canto 300 mm",0.3,1.9470000000000001,0.154,1670,1000,10]
["ForjadosRET","FR Entrevigado de hormigón - Canto 350 mm",0.35,1.9950000000000001,0.17499999999999999,1610,1000,10]
["ForjadosRET","FR Entrevigado de hormigón - Canto 400 mm",0.4,2.0430000000000001,0.19600000000000001,1570,1000,10]
["ForjadosRET","FR Entrevigado de hormigón - Canto 450 mm",0.45,2.0910000000000002,0.215,1540,1000,10]
["ForjadosRET","FR Entrevigado de hormigón aligerado - Canto 250 mm",0.25,1.788,0.14000000000000001,1645,1000,6]
["ForjadosRET","FR Entrevigado de hormigón aligerado - Canto 300 mm",0.3,1.8380000000000001,0.16300000000000001,1570,1000,6]
["ForjadosRET","FR Entrevigado de hormigón aligerado - Canto 350 mm",0.35,1.89,0.185,1515,1000,6]
["ForjadosRET","FR Entrevigado de hormigón aligerado - Canto 400 mm",0.4,1.9359999999999999,0.20699999999999999,1480,1000,6]
["ForjadosRET","FR Entrevigado de hormigón aligerado - Canto 450 mm",0.45,1.986,0.22700000000000001,1455,1000,6]
["ForjadosRET","FR Entrevigado de hormigón d < 1200 con áridos ligeros - Canto 250 mm",0.25,1.786,0.14000000000000001,1238,1000,6]
["ForjadosRET","FR Entrevigado de hormigón d < 1200 con áridos ligeros - Canto 300 mm",0.3,1.875,0.16,1185,1000,6]
["ForjadosRET","FR Entrevigado de hormigón d < 1200 con áridos ligeros - Canto 350 mm",0.35,1.8420000000000001,0.19,1138,1000,6]
["ForjadosRET","FR Entrevigado de hormigón d < 1200 con áridos ligeros - Canto 400 mm",0.4,1.905,0.21,1115,1000,6]
["ForjadosRET","FR Entrevigado de hormigón d < 1200 con áridos ligeros - Canto 450 mm",0.45,2.0910000000000002,0.215,1092,1000,6]
["ForjadosRET","FR sin Entrevigado - Canto 250 mm",0.25,4.1669999999999998,0.06,2350,1000,80]
["ForjadosRET","FR sin Entrevigado - Canto 300 mm",0.3,4.2859999999999996,7.0000000000000007E-2,2350,1000,80]
["ForjadosRET","FR sin Entrevigado - Canto 350 mm",0.35,4.6509999999999998,7.4999999999999997E-2,2350,1000,80]
["ForjadosUNI","FU con viguetas de madera con entrevigado de revoltón de ladrillo y cascote [min. 120 mm]",null,1.335,null,840,800,5]
["ForjadosUNI","FU Entrevigado cerámico - Canto 210 mm",0.21,0.84,0.25,1338,800,10]
["ForjadosUNI","FU Entrevigado cerámico - Canto 250 mm",0.25,0.90800000000000003,0.27500000000000002,1220,1000,10]
["ForjadosUNI","FU Entrevigado cerámico - Canto 300 mm",0.3,0.84599999999999997,0.35499999999999998,1110,1000,10]
["ForjadosUNI","FU Entrevigado cerámico - Canto 350 mm",0.35,0.995,0.35199999999999998,1030,1000,10]
["ForjadosUNI","FU Entrevigado de EPS mecanizado enrasado - Canto 250 mm",0.25,0.26600000000000001,0.94,800,1000,60]
["ForjadosUNI","FU Entrevigado de EPS mecanizado enrasado - Canto 300 mm",0.3,0.25600000000000001,1.1719999999999999,750,1000,60]
["ForjadosUNI","FU Entrevigado de EPS mecanizado enrasado - Canto 350 mm",0.35,0.255,1.373,700,1000,60]
["ForjadosUNI","FU Entrevigado de EPS moldeado descolgado - Canto 250 mm",0.25,0.17599999999999999,1.42,710,1000,60]
["ForjadosUNI","FU Entrevigado de EPS moldeado descolgado - Canto 300 mm",0.3,0.2,1.5,670,1000,60]
["ForjadosUNI","FU Entrevigado de EPS moldeado descolgado - Canto 350 mm",0.35,0.223,1.57,640,1000,60]
["ForjadosUNI","FU Entrevigado de EPS moldeado enrasado - Canto 250 mm",0.25,0.313,0.79900000000000004,790,1000,60]
["ForjadosUNI","FU Entrevigado de EPS moldeado enrasado - Canto 300 mm",0.3,0.34100000000000003,0.88,740,1000,60]
["ForjadosUNI","FU Entrevigado de EPS moldeado enrasado - Canto 350 mm",0.35,0.36799999999999999,0.95099999999999996,690,1000,60]
["ForjadosUNI","FU Entrevigado de hormigón - Canto 250 mm",0.25,1.323,0.189,1330,1000,80]
["ForjadosUNI","FU Entrevigado de hormigón - Canto 300 mm",0.3,1.4219999999999999,0.21099999999999999,1240,1000,80]
["ForjadosUNI","FU Entrevigado de hormigón - Canto 350 mm",0.35,1.528,0.22900000000000001,1180,1000,80]
["ForjadosUNI","FU Entrevigado de hormigón aligerado - Canto 250 mm",0.25,1,0.25,1180,1000,6]
["ForjadosUNI","FU Entrevigado de hormigón aligerado - Canto 300 mm",0.3,1.111,0.27,1090,1000,6]
["ForjadosUNI","FU Entrevigado de hormigón aligerado - Canto 350 mm",0.35,1.2110000000000001,0.28899999999999998,1035,1000,6]
["ForjadosUNI","FU Entrevigado de hormigón aligerado - Canto 400 mm",0.4,1.3109999999999999,0.30499999999999999,985,1000,6]
["ForjadosUNI","FU Entrevigado de hormigón aligerado d < 1200 - Canto 250 mm",0.25,1.121,0.223,1180,1000,6]
["ForjadosUNI","FU Entrevigado de hormigón aligerado d < 1200 - Canto 300 mm",0.3,1.22,0.246,1090,1000,6]
["ForjadosUNI","FU Entrevigado de hormigón aligerado d < 1200 - Canto 350 mm",0.35,1.3109999999999999,0.26700000000000002,1035,1000,6]
["ForjadosUNI","FU Entrevigado de hormigón aligerado d < 1200 - Canto 400 mm",0.4,1.4079999999999999,0.28399999999999997,985,1000,6]
["ForjadosUNI","FU Entrevigado de picón - Canto 300 mm",0.3,0.88200000000000001,0.34,1273,800,80]
["ForjadosUNI","FU Entrevigado de picón - Canto 350 mm",0.35,0.97199999999999998,0.36,1306,800,80]
["Hormigones","Hormigón armado 2300 < d < 2500",null,2.2999999999999998,null,2400,1000,80]
["Hormigones","Hormigón armado d > 2500",null,2.5,null,2600,1000,80]
["Hormigones","Hormigón celular curado en autoclave d 1000",null,0.28999999999999998,null,1000,1000,6]
["Hormigones","Hormigón celular curado en autoclave d 300",null,0.09,null,300,1000,6]
["Hormigones","Hormigón celular curado en autoclave d 400",null,0.12,null,400,1000,6]
["Hormigones","Hormigón celular curado en autoclave d 500",null,0.14000000000000001,null,500,1000,6]
["Hormigones","Hormigón celular curado en autoclave d 600",null,0.18,null,600,1000,6]
["Hormigones","Hormigón celular curado en autoclave d 700",null,0.2,null,700,1000,6]
["Hormigones","Hormigón celular curado en autoclave d 800",null,0.23,null,800,1000,6]
["Hormigones","Hormigón celular curado en autoclave d 900",null,0.27,null,900,1000,6]
["Hormigones","Hormigón con arcilla expandida como árido principal d 1000",null,0.35,null,1000,1000,6]
["Hormigones","Hormigón con arcilla expandida como árido principal d 1100",null,0.39,null,1100,1000,6]
["Hormigones","Hormigón con arcilla expandida como árido principal d 1200",null,0.44,null,1200,1000,6]
["Hormigones","Hormigón con arcilla expandida como árido principal d 1300",null,0.5,null,1300,1000,6]
["Hormigones","Hormigón con arcilla expandida como árido principal d 1400",null,0.55000000000000004,null,1400,1000,6]
["Hormigones","Hormigón con arcilla expandida como árido principal d 1500",null,0.61,null,1500,1000,6]
["Hormigones","Hormigón con arcilla expandida como árido principal d 1600",null,0.68,null,1600,1000,6]
["Hormigones","Hormigón con arcilla expandida como árido principal d 1700",null,0.76,null,1700,1000,6]
["Hormigones","Hormigón con arcilla expandida como árido principal d 800",null,0.27,null,800,1000,6]
["Hormigones","Hormigón con arcilla expandida como árido principal d 900",null,0.3,null,900,1000,6]
["Hormigones","Hormigón con arcilla expandida sin otros áridos d 400",null,0.13,null,400,1000,4]
["Hormigones","Hormigón con arcilla expandida sin otros áridos d 500",null,0.16,null,500,1000,4]
["Hormigones","Hormigón con arcilla expandida sin otros áridos d 600",null,0.19,null,600,1000,4]
["Hormigones","Hormigón con arcilla expandida sin otros áridos d 700",null,0.22,null,700,1000,4]
["Hormigones","Hormigón con áridos ligeros 1600 < d < 1800",null,1.1499999999999999,null,1700,1000,60]
["Hormigones","Hormigón con áridos ligeros 1800 < d < 2000",null,1.35,null,1900,1000,60]
["Hormigones","Hormigón con otros áridos ligeros d 1000",null,0.3,null,1000,1000,10]
["Hormigones","Hormigón con otros áridos ligeros d 1100",null,0.34,null,1100,1000,10]
["Hormigones","Hormigón con otros áridos ligeros d 1200",null,0.37,null,1200,1000,10]
["Hormigones","Hormigón con otros áridos ligeros d 1300",null,0.42,null,1300,1000,10]
["Hormigones","Hormigón con otros áridos ligeros d 1400",null,0.46,null,1400,1000,10]
["Hormigones","Hormigón con otros áridos ligeros d 1500",null,0.52,null,1500,1000,10]
["Hormigones","Hormigón con otros áridos ligeros d 1600",null,0.59,null,1600,1000,10]
["Hormigones","Hormigón con otros áridos ligeros d 1800",null,1.22,null,1800,1000,10]
["Hormigones","Hormigón con otros áridos ligeros d 2000",null,1.5,null,2000,1000,10]
["Hormigones","Hormigón con otros áridos ligeros d 500",null,0.94,null,500,1000,10]
["Hormigones","Hormigón con otros áridos ligeros d 600",null,0.83,null,600,1000,10]
["Hormigones","Hormigón con otros áridos ligeros d 700",null,0.74,null,700,1000,10]
["Hormigones","Hormigón con otros áridos ligeros d 800",null,0.65,null,800,1000,10]
["Hormigones","Hormigón con otros áridos ligeros d 900",null,0.27,null,900,1000,10]
["Hormigones","Hormigón convencional d 1600",null,0.97,null,1600,1000,120]
["Hormigones","Hormigón convencional d 1700",null,1.03,null,1700,1000,120]
["Hormigones","Hormigón convencional d 1800",null,1.1200000000000001,null,1800,1000,120]
["Hormigones","Hormigón convencional d 1900",null,1.2,null,1900,1000,120]
["Hormigones","Hormigón convencional d 2000",null,1.32,null,2000,1000,120]
["Hormigones","Hormigón convencional d 2100",null,1.44,null,2100,1000,120]
["Hormigones","Hormigón convencional d 2200",null,1.57,null,2200,1000,120]
["Hormigones","Hormigón convencional d 2300",null,1.72,null,2300,1000,120]
["Hormigones","Hormigón convencional d 2400",null,1.9,null,2400,1000,120]
["Hormigones","Hormigón en masa 2000 < d < 2300",null,1.65,null,2150,1000,70]
["Hormigones","Hormigón en masa 2300 < d < 2600",null,2,null,2450,1000,80]
["Hormigones","Teja de hormigón",null,1.5,null,2100,1000,60]
["Ladrillo","1 pie LM métrico o catalán 40 mm < G < 50 mm",0.24,1.03,0.23300000000000001,2140,1000,10]
["Ladrillo","1 pie LP métrico o catalán 40 mm < G < 60 mm",0.24,0.66700000000000004,0.36,1220,1000,10]
["Ladrillo","1 pie LP métrico o catalán 60 mm < G < 80 mm",0.24,0.56699999999999995,0.42299999999999999,1150,1000,10]
["Ladrillo","1 pie LP métrico o catalán 80 mm < G < 100 mm",0.24,0.51200000000000001,0.46899999999999997,1000,1000,10]
["Ladrillo","1/2 pie LM métrico o catalán 40 mm < G < 50 mm",0.123,1.02,0.121,2170,1000,10]
["Ladrillo","1/2 pie LP métrico o catalán 40 mm < G < 60 mm",0.123,0.68,0.18099999999999999,1140,1000,10]
["Ladrillo","1/2 pie LP métrico o catalán 60 mm < G < 80 mm",0.115,0.56699999999999995,0.20300000000000001,1020,1000,10]
["Ladrillo","1/2 pie LP métrico o catalán 80 mm < G < 100 mm",0.115,0.51200000000000001,0.22500000000000001,900,1000,10]
["Ladrillo","Ladrillo de hormigón macizo de áridos densos",null,1.714,null,1800,1000,10]
["Ladrillo","Ladrillo de hormigón perforado de áridos densos",null,1.091,null,1258,1000,10]
["Ladrillo","Ladrillo de hormigón perforado de áridos ligeros",null,0.39500000000000002,null,1183,1000,6]
["Ladrillo","Tabicón de LH doble [60 mm < E < 90 mm]",null,0.432,null,930,1000,10]
["Ladrillo","Tabicón de LH doble Gran Formato [60 mm < E < 90 mm]",null,0.21199999999999999,null,630,1000,10]
["Ladrillo","Tabicón de LH sencillo [40 mm < E < 60 mm]",null,0.55600000000000005,null,1000,1000,10]
["Ladrillo","Tabique de LH sencillo Gran Formato [40 mm < E < 60 mm]",null,0.22800000000000001,null,670,1000,10]
["Ladrillo","Tabique de LH triple [100 mm < E < 110 mm]",null,0.42699999999999999,null,920,1000,10]
["Ladrillo","Tabicón de LH triple Gran Formato [100 mm < E < 110 mm]",null,0.20599999999999999,null,620,1000,10]
["Losas_Alveolares","Con capa de compresión - Canto 200 mm",0.2,1.4039999999999999,0.14199999999999999,1810,1000,80]
["Losas_Alveolares","Con capa de compresión - Canto 250 mm",0.25,1.56,0.16,1580,1000,80]
["Losas_Alveolares","Con capa de compresión - Canto 300 mm",0.3,1.6180000000000001,0.185,1530,1000,80]
["Losas_Alveolares","Con capa de compresión - Canto 350 mm",0.35,1.698,0.20599999999999999,1440,1000,80]
["Losas_Alveolares","Con capa de compresión - Canto 400 mm",0.4,1.8,0.222,1320,1000,80]
["Losas_Alveolares","Con capa de compresión - Canto 500 mm",0.5,2.02,0.248,1300,1000,80]
["Losas_Alveolares","Losa de hormigón d = 2000 - Canto 200 mm",0.2,1.667,0.12,2000,1000,80]
["Losas_Alveolares","Losa de hormigón d = 2000 - Canto 250 mm",0.25,1.667,0.15,2000,1000,80]
["Losas_Alveolares","Losa de hormigón d = 2000 - Canto 300 mm",0.3,1.667,0.18,2000,1000,80]
["Losas_Alveolares","Losa de hormigón d = 2000 - Canto 350 mm",0.35,1.667,0.21,2000,1000,80]
["Losas_Alveolares","Losa de hormigón d = 2000 - Canto 400 mm",0.4,1.667,0.24,2000,1000,80]
["Losas_Alveolares","Losa de hormigón d = 2000 - Canto 500 mm",0.5,1.667,0.3,2000,1000,80]
["Losas_Alveolares","Losa de hormigón d = 2500 - Canto 200 mm",0.2,2.5,0.08,2500,1000,80]
["Losas_Alveolares","Losa de hormigón d = 2500 - Canto 250 mm",0.25,2.5,0.1,2500,1000,80]
["Losas_Alveolares","Losa de hormigón d = 2500 - Canto 300 mm",0.3,2.5,0.12,2500,1000,80]
["Losas_Alveolares","Losa de hormigón d = 2500 - Canto 350 mm",0.35,2.5,0.14000000000000001,2500,1000,80]
["Losas_Alveolares","Losa de hormigón d = 2500 - Canto 400 mm",0.4,2.5,0.16,2500,1000,80]
["Losas_Alveolares","Losa de hormigón d = 2500 - Canto 500 mm",0.5,2.5,0.2,2500,1000,80]
["Losas_Alveolares","Sin capa de compresión - Canto 200 mm",0.2,1.4039999999999999,0.14199999999999999,1410,1000,80]
["Losas_Alveolares","Sin capa de compresión - Canto 250 mm",0.25,1.56,0.16,1380,1000,80]
["Losas_Alveolares","Sin capa de compresión - Canto 300 mm",0.3,1.6180000000000001,0.185,1180,1000,80]
["Losas_Alveolares","Sin capa de compresión - Canto 350 mm",0.35,1.698,0.20599999999999999,1180,1000,80]
["Losas_Alveolares","Sin capa de compresión - Canto 400 mm",0.4,1.8,0.222,1180,1000,80]
["Losas_Alveolares","Sin capa de compresión - Canto 500 mm",0.5,2.02,0.248,1120,1000,80]
["Maderas","Balsa d < 200",null,5.7000000000000002E-2,null,180,1600,20]
["Maderas","Conífera de peso medio 435 < d < 520",null,0.15,null,480,1600,20]
["Maderas","Conífera ligera d < 435",null,0.13,null,430,1600,20]
["Maderas","Conífera muy pesada d > 610",null,0.23,null,620,1600,20]
["Maderas","Conífera pesada 520 < d < 610",null,0.18,null,570,1600,20]
["Maderas","Corcho Comprimido",null,0.1,null,450,1560,5]
["Maderas","Corcho Expandido con resinas sintéticas 100 < d < 150",null,4.9000000000000002E-2,null,125,1560,5]
["Maderas","Corcho Expandido con resinas sintéticas 150 < d < 250",null,5.5E-2,null,200,1560,5]
["Maderas","Corcho Expandido puro 100 < d < 150",null,4.9000000000000002E-2,null,125,1560,5]
["Maderas","Frondosa ligera 435 < d < 565",null,0.15,null,500,1600,50]
["Maderas","Frondosa muy ligera 200 < d < 435",null,0.13,null,320,1600,50]
["Maderas","Frondosa muy pesada d > 870",null,0.28999999999999998,null,900,1600,50]
["Maderas","Frondosa pesada 750 < d < 870",null,0.23,null,775,1600,50]
["Maderas","Frondosa peso medio 565 < d < 750",null,0.18,null,660,1600,50]
["Maderas","Paneles de fibras con conglomerante hidraúlico 250 < d < 350",null,0.1,null,300,1700,5]
["Maderas","Paneles de fibras con conglomerante hidraúlico 350 < d < 450",null,0.12,null,400,1700,5]
["Maderas","Paneles de fibras con conglomerante hidraúlico 450 < d < 550",null,0.15,null,500,1700,12]
["Maderas","Placas de corcho",null,6.5000000000000002E-2,null,450,1500,20]
["Maderas","Tablero contrachapado 250 < d < 350",null,0.11,null,300,1600,50]
["Maderas","Tablero contrachapado 350 < d < 450",null,0.13,null,400,1600,70]
["Maderas","Tablero contrachapado 450 < d < 500",null,0.15,null,475,1600,70]
["Maderas","Tablero contrachapado 500 < d < 600",null,0.17,null,550,1600,90]
["Maderas","Tablero contrachapado 600 < d < 750",null,0.21,null,675,1600,110]
["Maderas","Tablero contrachapado 700 < d < 900",null,0.24,null,800,1600,110]
["Maderas","Tablero contrachapado d < 250",null,0.09,null,200,1600,50]
["Maderas","Tablero de partículas 180 < d < 270",null,0.1,null,225,1700,20]
["Maderas","Tablero de partículas 270 < d < 450",null,0.13,null,360,1700,20]
["Maderas","Tablero de partículas 450 < d < 640",null,0.15,null,545,1700,20]
["Maderas","Tablero de partículas 640 < d < 820",null,0.18,null,730,1700,20]
["Maderas","Tablero de partículas con cemento d = 1200",null,0.23,null,1200,1500,30]
["Maderas","Tablero de virutas orientadas [OSB] d < 650",null,0.13,null,600,1700,30]
["Maderas","Tableros de fibras incluyendo MDF 200 < d < 350",null,0.1,null,275,1700,6]
["Maderas","Tableros de fibras incluyendo MDF 350 < d < 550",null,0.14000000000000001,null,450,1700,12]
["Maderas","Tableros de fibras incluyendo MDF 550 < d < 750",null,0.18,null,650,1700,20]
["Maderas","Tableros de fibras incluyendo MDF 750 < d < 1000",null,0.2,null,875,1700,20]
["Maderas","Tableros de fibras incluyendo MDF d < 200",null,7.0000000000000007E-2,null,180,1700,2]
["Metales","Acero",null,50,null,7800,450,{"$f":"1E+30","v":1E+30}]
["Metales","Acero Inoxidable",null,17,null,7900,460,{"$f":"1E+30","v":1E+30}]
["Metales","Aliminio aleaciones",null,160,null,2700,880,1E+30]
["Metales","Aluminio",null,230,null,2800,880,1E+30]
["Metales","Bronce",null,65,null,8700,380,1E+30]
["Metales","Cobre",null,380,null,8900,380,1E+30]
["Metales","Cromo",null,93.7,null,7160,449,1E+30]
["Metales","Estaño",null,66.599999999999994,null,7310,227,1E+30]
["Metales","Hierro",null,72,null,7870,450,1E+30]
["Metales","Hierro fundición",null,50,null,7500,450,1E+30]
["Metales","Latón",null,120,null,8400,380,1E+30]
["Metales","Níquel",null,90.7,null,8900,444,1E+30]
["Metales","Plomo",null,35,null,11300,130,1E+30]
["Metales","Titanio",null,21.9,null,4500,522,1E+30]
["Metales","Zinc",null,110,null,7200,380,1E+30]
["Morteros","Mortero de áridos ligeros [vermiculita perlita]",null,0.41,null,900,1000,10]
["Morteros","Mortero de cemento o cal para albañilería y para revoco/enlucido  d > 2000",null,1.8,null,2100,1000,10]
["Morteros","Mortero de cemento o cal para albañilería y para revoco/enlucido 1000 < d < 1250",null,0.55000000000000004,null,1125,1000,10]
["Morteros","Mortero de cemento o cal para albañilería y para revoco/enlucido 1250 < d < 1450",null,0.7,null,1350,1000,10]
["Morteros","Mortero de cemento o cal para albañilería y para revoco/enlucido 1450 < d < 1600",null,0.8,null,1525,1000,10]
["Morteros","Mortero de cemento o cal para albañilería y para revoco/enlucido 1600 < d < 1800",null,1,null,1700,1000,10]
["Morteros","Mortero de cemento o cal para albañilería y para revoco/enlucido 1800 < d < 2000",null,1.3,null,1900,1000,10]
["Morteros","Mortero de cemento o cal para albañilería y para revoco/enlucido 500 < d < 750",null,0.3,null,625,1000,10]
["Morteros","Mortero de cemento o cal para albañilería y para revoco/enlucido 750 < d < 1000",null,0.4,null,875,1000,10]
["Morteros","Mortero de yeso",null,0.8,null,1500,1000,6]
["Pétreos_Suelos","Arcilla o limo [1200 < d < 1800]",null,1.5,null,1500,2100,50]
["Pétreos_Suelos","Arena y grava [1700 < d < 2200]",null,2,null,1450,1050,50]
["Pétreos_Suelos","Arenisca [2200 < d < 2600]",null,3,null,2400,1000,50]
["Pétreos_Suelos","Asperón [1300 < d < 1900]",null,0.9,null,1600,1000,20]
["Pétreos_Suelos","Asperón [1900 < d < 2500]",null,1.8,null,2200,1000,40]
["Pétreos_Suelos","Basalto [2700 < d < 3000]",null,3.5,null,2850,1000,10000]
["Pétreos_Suelos","Caliza blanda [1600 < d < 1790]",null,1.1000000000000001,null,1625,1000,25]
["Pétreos_Suelos","Caliza dura [2000 < d < 2190]",null,1.7,null,2095,1000,150]
["Pétreos_Suelos","Caliza dureza media [1800 < d < 1990]",null,1.4,null,1895,1000,40]
["Pétreos_Suelos","Caliza muy blanda [d < 1590]",null,0.85,null,1500,1000,20]
["Pétreos_Suelos","Caliza muy dura [2200 < d < 2590]",null,2.2999999999999998,null,2395,1000,200]
["Pétreos_Suelos","Cascote de ladrillo",null,0.41,null,1300,100,10]
["Pétreos_Suelos","Esquisto Pizarra [2000 < d < 2800]",null,2.2000000000000002,null,2400,1000,800]
["Pétreos_Suelos","Gneis Pórfido [2300 < d < 2900]",null,3.5,null,2600,1000,10000]
["Pétreos_Suelos","Granito [2500 < d < 2700]",null,2.8,null,2600,1000,10000]
["Pétreos_Suelos","Mármol [2600 < d < 2800]",null,3.5,null,2700,1000,10000]
["Pétreos_Suelos","Piedra artificial",null,1.3,null,1700,1000,40]
["Pétreos_Suelos","Piedra pómez natural [d < 400]",null,0.12,null,390,1000,6]
["Pétreos_Suelos","Relleno de cascote de ladrillo",null,0.41,null,1300,800,10]
["Pétreos_Suelos","Roca natural porosa [por ejem. Lava] d < 1600",null,0.55000000000000004,null,1500,1000,15]
["Pétreos_Suelos","Silex [2600 < d < 2800]",null,2.6,null,2700,1000,10000]
["Pétreos_Suelos","Tierra apisonada adobe bloques de tierra comprimida [1770 < d < 2000]",null,1.1000000000000001,null,1885,1000,1]
["Pétreos_Suelos","Tierra cruda con densidad 1000 Kg/m³",null,0.4,null,1000,1000,3]
["Pétreos_Suelos","Tierra cruda con densidad 1200 Kg/m³",null,0.5,null,1200,1000,3]
["Pétreos_Suelos","Tierra cruda con densidad 1400 Kg/m³",null,0.6,null,1400,1000,3]
["Pétreos_Suelos","Tierra cruda con densidad 1600 Kg/m³",null,0.8,null,1600,1000,3]
["Pétreos_Suelos","Tierra cruda con densidad 1800 Kg/m³",null,1,null,1800,1000,3]
["Pétreos_Suelos","Tierra cruda con densidad 2000 Kg/m³",null,1.2,null,2000,1000,3]
["Pétreos_Suelos","Tierra cruda con densidad 800 Kg/m³",null,0.3,null,800,1000,3]
["Pétreos_Suelos","Tierra vegetal [d < 2050]",null,0.52,null,2000,1845,1]
["Pétreos_Suelos","Traquita andesita [2000 < d < 2700]",null,1.1000000000000001,null,2350,1000,15]
["Plásticos","Acrílicos",null,0.2,null,1050,1500,10000]
["Plásticos","Cloruro de polivinilo [PVC]",null,0.17,null,1390,900,50000]
["Plásticos","Linóleo",null,0.17,null,1200,1400,800]
["Plásticos","Poliacetato",null,0.3,null,1410,1400,100000]
["Plásticos","Poliamida [nylon] [PA]",null,0.25,null,1150,1600,50000]
["Plásticos","Poliamida 6.6 [PA6.6] 25% fibra de vidrio",null,0.3,null,1450,1600,50000]
["Plásticos","Policarbonatos [PC]",null,0.2,null,1200,1200,5000]
["Plásticos","Poliestireno [PS]",null,0.16,null,1050,1300,100000]
["Plásticos","Polietileno alta densidad [HDPE]",null,0.5,null,980,1800,100000]
["Plásticos","Polietileno baja densidad [LDPE]",null,0.33,null,920,2200,100000]
["Plásticos","Polimetilmetacrilato [PMMA]",null,0.18,null,1180,1500,50000]
["Plásticos","Polipropileno [PP]",null,0.22,null,910,1800,10000]
["Plásticos","Polipropileno [PP] 25% fibra de vidrio",null,0.25,null,1200,1800,10000]
["Plásticos","Politetrafluoretileno [PTFE]",null,0.25,null,2200,1000,10000]
["Plásticos","Poliuretano [PU]",null,0.25,null,1200,1800,6000]
["Plásticos","Resina epoxi",null,0.2,null,1200,1400,10000]
["Plásticos","Resina fenólica",null,0.3,null,1300,1700,100000]
["Plásticos","Resina poliéster no saturado [UP]",null,0.19,null,1400,1200,10000]
["Plásticos","Teja plástico",null,0.2,null,1000,1000,10000]
["Sellantes","Cloruro de polivinilo [PVC] + 40% plastificante",null,0.14000000000000001,null,1200,1000,100000]
["Sellantes","Espuma de polietileno",null,0.05,null,70,2300,100]
["Sellantes","Espuma de poliuretano [PU]",null,0.05,null,70,1500,60]
["Sellantes","Espuma de silicona",null,0.12,null,750,1000,10000]
["Sellantes","Espuma elastomérica-flexible",null,0.05,null,70,1500,10000]
["Sellantes","Sílica gel [desecante]",null,0.13,null,720,1000,{"$f":"1E+30","v":1E+30}]
["Sellantes","Silicona masilla",null,0.5,null,1450,1000,5000]
["Sellantes","Silicona pura",null,0.35,null,1200,1000,5000]
["Sellantes","Uretano o poliuretano [rotura de puente térmico]",null,0.21,null,1300,1800,60]
["Textiles","Moquetas revestimientos textiles",null,0.06,null,200,1300,5]
["Textiles","Subcapa fieltro",null,0.05,null,120,1300,15]
["Textiles","Subcapa lana",null,0.06,null,200,1300,15]
["Vidrios","Cuarzo",null,1.4,null,2200,750,{"$f":"1E+30","v":1E+30}]
["Vidrios","Sodocálcico [inc. Vidrio flotado]",null,1,null,2500,750,{"$f":"1E+30","v":1E+30}]
["Vidrios","Vidrio prensado",null,1.2,null,2000,750,{"$f":"1E+30","v":1E+30}]
["Yesos","Placa de yeso laminado [PYL] 750 < d < 900",null,0.25,null,825,1000,4]
["Yesos","Placa de yeso o escayola 750 < d < 900",null,0.25,null,825,1000,4]
["Yesos","Placas de yeso armado con fibras minerales 800 < d < 1000",null,0.25,null,900,1000,4]
["Yesos","Yeso alta dureza 1200 < d < 1500",null,0.56000000000000005,null,1350,1000,4]
["Yesos","Yeso alta dureza 900 < d < 1200",null,0.43,null,1050,1000,4]
["Yesos","Yeso baja dureza d < 600",null,0.18,null,500,1000,4]
["Yesos","Yeso dureza media 600 < d < 900",null,0.3,null,750,1000,4]

{"sheet":"Desp. Materiales","index":4,"n_rows":53,"n_cols":26,"rows_kept":53,"cut":false,"hidden":true,"merged":[]}
["Grupo",null,"AislamientosValero","Aislantes","Bituminosos","Bloque_Cerámico","Bloque_HormigónAL","Bloque_HormigónCO","Cámaras_Aire","Cauchos","Cerámicos","Enlucidos","ForjadosRET","ForjadosUNI","Hormigones","Ladrillo","Losas_Alveolares","Maderas","Metales","Morteros","Pétreos_Suelos","Plásticos","Sellantes","Textiles","Vidrios","Yesos"]
["AislamientosValero",null,"EEPS-GrafipolTR0_Valero","EPS Poliestireno expandido [0,029 W/mK]","Asfalto","BC con mortero aislante espesor 140 mm","BH aligerado hueco espesor 250 mm","BH convencional espesor 100 mm","Cámara de aire ligeramente ventilada horizontal 1 cm","Butadieno","Azulejo cerámico","Enlucido de yeso 1000 < d < 1300","FR Entrevigado cerámico - Canto 250 mm","FU con viguetas de madera con entrevigado de revoltón de ladrillo y cascote [min. 120 mm]","Hormigón armado 2300 < d < 2500","1 pie LM métrico o catalán 40 mm < G < 50 mm","Con capa de compresión - Canto 200 mm","Balsa d < 200","Acero","Mortero de áridos ligeros [vermiculita perlita]","Arcilla o limo [1200 < d < 1800]","Acrílicos","Cloruro de polivinilo [PVC] + 40% plastificante","Moquetas revestimientos textiles","Cuarzo","Placa de yeso laminado [PYL] 750 < d < 900"]
["Aislantes",null,"EEPS-GrafipolTR0-Impact_Valero","EPS Poliestireno expandido [0,032 W/mK]","Asfalto arenoso","BC con mortero aislante espesor 190 mm","BH aligerado hueco espesor 300 mm","BH convencional espesor 150 mm","Cámara de aire ligeramente ventilada horizontal 10 cm","Butilo [isobutelo] compacto/colado en aceite","Gres (sílice) 2200 < d < 2590","Enlucido de yeso aislante 500 < d < 600","FR Entrevigado cerámico - Canto 300 mm","FU Entrevigado cerámico - Canto 210 mm","Hormigón armado d > 2500","1 pie LP métrico o catalán 40 mm < G < 60 mm","Con capa de compresión - Canto 250 mm","Conífera de peso medio 435 < d < 520","Acero Inoxidable","Mortero de cemento o cal para albañilería y para revoco/enlucido  d > 2000","Arena y grava [1700 < d < 2200]","Cloruro de polivinilo [PVC]","Espuma de polietileno","Subcapa fieltro","Sodocálcico [inc. Vidrio flotado]","Placa de yeso o escayola 750 < d < 900"]
["Bituminosos",null,"EPS-DonpolAzul_Valero","EPS Poliestireno expandido [0,036 W/mK]","Betún fieltro o lámina","BC con mortero aislante espesor 240 mm","BH aligerado hueco -muro de carga- espesor 300 mm","BH convencional espesor 200 mm","Cámara de aire ligeramente ventilada horizontal 2 cm","Caucho celular","Gres calcáreo 2000 < d < 2700","Enlucido de yeso aislante 600 < d < 900","FR Entrevigado cerámico - Canto 350 mm","FU Entrevigado cerámico - Canto 250 mm","Hormigón celular curado en autoclave d 1000","1 pie LP métrico o catalán 60 mm < G < 80 mm","Con capa de compresión - Canto 300 mm","Conífera ligera d < 435","Aliminio aleaciones","Mortero de cemento o cal para albañilería y para revoco/enlucido 1000 < d < 1250","Arenisca [2200 < d < 2600]","Linóleo","Espuma de poliuretano [PU]","Subcapa lana","Vidrio prensado","Placas de yeso armado con fibras minerales 800 < d < 1000"]
["Bloque_Cerámico",null,"EPS-DonpolVerdeHidrófobo_Valero","MW Lana mineral [0,032 W/mK]","Betún puro","BC con mortero aislante espesor 290 mm","BH aligerado hueco -muro de carga- espesor 300 mm con mortero aligerado","BH convencional espesor 250 mm","Cámara de aire ligeramente ventilada horizontal 5 cm","Caucho natural","Gres cuarzoso 2600 < d < 2800","Enlucido de yeso d < 1000","FR Entrevigado de EPS mecanizado enrasado - Canto 250 mm","FU Entrevigado cerámico - Canto 300 mm","Hormigón celular curado en autoclave d 300","1 pie LP métrico o catalán 80 mm < G < 100 mm","Con capa de compresión - Canto 350 mm","Conífera muy pesada d > 610","Aluminio","Mortero de cemento o cal para albañilería y para revoco/enlucido 1250 < d < 1450","Asperón [1300 < d < 1900]","Poliacetato","Espuma de silicona",null,null,"Yeso alta dureza 1200 < d < 1500"]
["Bloque_HormigónAL",null,"EPS-GrafipolCubInclinadas_Valero","MW Lana mineral [0,034 W/mK]",null,"BC con mortero convencional espesor 140 mm","BH aligerado macizo con áridos ligeros 140 mm","BH convencional espesor 300 mm","Cámara de aire ligeramente ventilada vertical 1 cm","Caucho rígido [ebonita] sólido","Plaqueta o baldosa cerámica",null,"FR Entrevigado de EPS mecanizado enrasado - Canto 300 mm","FU Entrevigado cerámico - Canto 350 mm","Hormigón celular curado en autoclave d 400","1/2 pie LM métrico o catalán 40 mm < G < 50 mm","Con capa de compresión - Canto 400 mm","Conífera pesada 520 < d < 610","Bronce","Mortero de cemento o cal para albañilería y para revoco/enlucido 1450 < d < 1600","Asperón [1900 < d < 2500]","Poliamida [nylon] [PA]","Espuma elastomérica-flexible",null,null,"Yeso alta dureza 900 < d < 1200"]
["Bloque_HormigónCO",null,"EPS-GrafipolFrenteForjado_Valero","MW Lana mineral [0,035 W/mK]",null,"BC con mortero convencional espesor 190 mm","BH aligerado macizo con áridos ligeros 170 mm","BH hueco con áridos densos 110 mm","Cámara de aire ligeramente ventilada vertical 10 cm","Etileno propileno dieno monómero [EPDM]","Plaqueta o baldosa de gres",null,"FR Entrevigado de EPS mecanizado enrasado - Canto 350 mm","FU Entrevigado de EPS mecanizado enrasado - Canto 250 mm","Hormigón celular curado en autoclave d 500","1/2 pie LP métrico o catalán 40 mm < G < 60 mm","Con capa de compresión - Canto 500 mm","Corcho Comprimido","Cobre","Mortero de cemento o cal para albañilería y para revoco/enlucido 1600 < d < 1800","Basalto [2700 < d < 3000]","Poliamida 6.6 [PA6.6] 25% fibra de vidrio","Sílica gel [desecante]",null,null,"Yeso baja dureza d < 600"]
["Cámaras_Aire",null,"EPS-GrafipolTermoimpact_Valero","MW Lana mineral [0,036 W/mK]",null,"BC con mortero convencional espesor 240 mm","BH aligerado macizo con áridos ligeros 240 mm","BH hueco con áridos densos 140 mm","Cámara de aire ligeramente ventilada vertical 2 cm","Neopreno [policloropreno]","Teja cerámica-porcelana",null,"FR Entrevigado de EPS mecanizado enrasado - Canto 400 mm","FU Entrevigado de EPS mecanizado enrasado - Canto 300 mm","Hormigón celular curado en autoclave d 600","1/2 pie LP métrico o catalán 60 mm < G < 80 mm","Losa de hormigón d = 2000 - Canto 200 mm","Corcho Expandido con resinas sintéticas 100 < d < 150","Cromo","Mortero de cemento o cal para albañilería y para revoco/enlucido 1800 < d < 2000","Caliza blanda [1600 < d < 1790]","Policarbonatos [PC]","Silicona masilla",null,null,"Yeso dureza media 600 < d < 900"]
["Cauchos",null,"EPS-GrafipolTR29_Valero","MW Lana mineral [0,037 W/mK]",null,"BC con mortero convencional espesor 290 mm","BH aligerado macizo con áridos ligeros 290 mm","BH hueco con áridos densos 190 mm","Cámara de aire ligeramente ventilada vertical 5 cm","Poliisobutileno","Teja de arcilla cocida",null,"FR Entrevigado de EPS mecanizado enrasado - Canto 450 mm","FU Entrevigado de EPS mecanizado enrasado - Canto 350 mm","Hormigón celular curado en autoclave d 700","1/2 pie LP métrico o catalán 80 mm < G < 100 mm","Losa de hormigón d = 2000 - Canto 250 mm","Corcho Expandido con resinas sintéticas 150 < d < 250","Estaño","Mortero de cemento o cal para albañilería y para revoco/enlucido 500 < d < 750","Caliza dura [2000 < d < 2190]","Poliestireno [PS]","Silicona pura"]
["Cerámicos",null,"EPS-GrafipolTR30_Valero","MW Lana mineral [0,041 W/mK]",null,null,"BH aligerado macizo con áridos ligeros 290 mm, muro de carga","BH hueco con áridos densos 240 mm","Cámara de aire sin ventilar horizontal 1 cm","Polisulfuro",null,null,"FR Entrevigado de EPS moldeado descolgado - Canto 250 mm","FU Entrevigado de EPS moldeado descolgado - Canto 250 mm","Hormigón celular curado en autoclave d 800","Ladrillo de hormigón macizo de áridos densos","Losa de hormigón d = 2000 - Canto 300 mm","Corcho Expandido puro 100 < d < 150","Hierro","Mortero de cemento o cal para albañilería y para revoco/enlucido 750 < d < 1000","Caliza dureza media [1800 < d < 1990]","Polietileno alta densidad [HDPE]","Uretano o poliuretano [rotura de puente térmico]"]
["Enlucidos",null,"EPS-GrafipolTR31_Valero","Panel de vidrio celular [CG]",null,null,"BH aligerado macizo con áridos ligeros 290 mm, muro de carga con mortero aislante","BH hueco con áridos densos 290 mm","Cámara de aire sin ventilar horizontal 10 cm",null,null,null,"FR Entrevigado de EPS moldeado descolgado - Canto 300 mm","FU Entrevigado de EPS moldeado descolgado - Canto 300 mm","Hormigón celular curado en autoclave d 900","Ladrillo de hormigón perforado de áridos densos","Losa de hormigón d = 2000 - Canto 350 mm","Frondosa ligera 435 < d < 565","Hierro fundición","Mortero de yeso","Caliza muy blanda [d < 1590]","Polietileno baja densidad [LDPE]"]
["ForjadosRET",null,"EPS-GrafipolTR32_Valero","PIR espuma de Poliisocianurato [0,023 W/mK]",null,null,"BH aligerado macizo espesor 200 mm","BH hueco con áridos densos 50 mm","Cámara de aire sin ventilar horizontal 2 cm",null,null,null,"FR Entrevigado de EPS moldeado descolgado - Canto 350 mm","FU Entrevigado de EPS moldeado descolgado - Canto 350 mm","Hormigón con arcilla expandida como árido principal d 1000","Ladrillo de hormigón perforado de áridos ligeros","Losa de hormigón d = 2000 - Canto 400 mm","Frondosa muy ligera 200 < d < 435","Latón",null,"Caliza muy dura [2200 < d < 2590]","Polimetilmetacrilato [PMMA]"]
["ForjadosUNI",null,"EPS-GrafipolTR5_Valero","PIR espuma de Poliisocianurato [0,025 W/mK]",null,null,"BH aligerado macizo espesor 250 mm","BH hueco con áridos densos 60 mm","Cámara de aire sin ventilar horizontal 5 cm",null,null,null,"FR Entrevigado de EPS moldeado descolgado - Canto 400 mm","FU Entrevigado de EPS moldeado enrasado - Canto 250 mm","Hormigón con arcilla expandida como árido principal d 1100","Tabicón de LH doble [60 mm < E < 90 mm]","Losa de hormigón d = 2000 - Canto 500 mm","Frondosa muy pesada d > 870","Níquel",null,"Cascote de ladrillo","Polipropileno [PP]"]
["Hormigones",null,"EPS-GrafipolTR-SATE_Valero","PUR espuma de Poliuretano [0,028 W/mK]",null,null,"BH aligerado macizo espesor 300 mm","BH hueco con áridos densos 80 mm","Cámara de aire sin ventilar vertical 1 cm",null,null,null,"FR Entrevigado de EPS moldeado descolgado - Canto 450 mm","FU Entrevigado de EPS moldeado enrasado - Canto 300 mm","Hormigón con arcilla expandida como árido principal d 1200","Tabicón de LH doble Gran Formato [60 mm < E < 90 mm]","Losa de hormigón d = 2500 - Canto 200 mm","Frondosa pesada 750 < d < 870","Plomo",null,"Esquisto Pizarra [2000 < d < 2800]","Polipropileno [PP] 25% fibra de vidrio"]
["Ladrillo",null,"EPS-GVSATE_Valero","XPS Poliestireno extruido [0,033 W/mK]",null,null,"BH aligerado macizo -muro de carga- espesor 300 mm","BH hueco con áridos densos 90 mm","Cámara de aire sin ventilar vertical 10 cm",null,null,null,"FR Entrevigado de EPS moldeado enrasado - Canto 250 mm","FU Entrevigado de EPS moldeado enrasado - Canto 350 mm","Hormigón con arcilla expandida como árido principal d 1300","Tabicón de LH sencillo [40 mm < E < 60 mm]","Losa de hormigón d = 2500 - Canto 250 mm","Frondosa peso medio 565 < d < 750","Titanio",null,"Gneis Pórfido [2300 < d < 2900]","Politetrafluoretileno [PTFE]"]
["Losas_Alveolares",null,null,"XPS Poliestireno extruido [0,034 W/mK]",null,null,"BH aligerado macizo -muro de carga- espesor 300 mm con mortero aligerado",null,"Cámara de aire sin ventilar vertical 2 cm",null,null,null,"FR Entrevigado de EPS moldeado enrasado - Canto 300 mm","FU Entrevigado de hormigón - Canto 250 mm","Hormigón con arcilla expandida como árido principal d 1400","Tabicón de LH triple Gran Formato [100 mm < E < 110 mm]","Losa de hormigón d = 2500 - Canto 300 mm","Paneles de fibras con conglomerante hidraúlico 250 < d < 350","Zinc",null,"Granito [2500 < d < 2700]","Poliuretano [PU]"]
["Maderas",null,null,"XPS Poliestireno extruido [0,036 W/mK]",null,null,"BH aligerado perforado con áridos ligeros 110 mm",null,"Cámara de aire sin ventilar vertical 5 cm",null,null,null,"FR Entrevigado de EPS moldeado enrasado - Canto 350 mm","FU Entrevigado de hormigón - Canto 300 mm","Hormigón con arcilla expandida como árido principal d 1500","Tabique de LH sencillo Gran Formato [40 mm < E < 60 mm]","Losa de hormigón d = 2500 - Canto 350 mm","Paneles de fibras con conglomerante hidraúlico 350 < d < 450",null,null,"Mármol [2600 < d < 2800]","Resina epoxi"]
["Metales",null,null,"XPS Poliestireno extruido [0,038 W/mK]",null,null,"BH aligerado perforado con áridos ligeros 140 mm",null,"Cámara de aire ventilada",null,null,null,"FR Entrevigado de EPS moldeado enrasado - Canto 400 mm","FU Entrevigado de hormigón - Canto 350 mm","Hormigón con arcilla expandida como árido principal d 1600","Tabique de LH triple [100 mm < E < 110 mm]","Losa de hormigón d = 2500 - Canto 400 mm","Paneles de fibras con conglomerante hidraúlico 450 < d < 550",null,null,"Piedra artificial","Resina fenólica"]
["Morteros",null,null,null,null,null,"BH aligerado perforado con áridos ligeros 190 mm",null,null,null,null,null,"FR Entrevigado de EPS moldeado enrasado - Canto 450 mm","FU Entrevigado de hormigón aligerado - Canto 250 mm","Hormigón con arcilla expandida como árido principal d 1700",null,"Losa de hormigón d = 2500 - Canto 500 mm","Placas de corcho",null,null,"Piedra pómez natural [d < 400]","Resina poliéster no saturado [UP]"]
["Pétreos_Suelos",null,null,null,null,null,"BH aligerado perforado con áridos ligeros 240 mm",null,null,null,null,null,"FR Entrevigado de hormigón - Canto 250 mm","FU Entrevigado de hormigón aligerado - Canto 300 mm","Hormigón con arcilla expandida como árido principal d 800",null,"Sin capa de compresión - Canto 200 mm","Tablero contrachapado 250 < d < 350",null,null,"Relleno de cascote de ladrillo","Teja plástico"]
["Plásticos",null,null,null,null,null,"BH aligerado perforado con áridos ligeros 290 mm",null,null,null,null,null,"FR Entrevigado de hormigón - Canto 300 mm","FU Entrevigado de hormigón aligerado - Canto 350 mm","Hormigón con arcilla expandida como árido principal d 900",null,"Sin capa de compresión - Canto 250 mm","Tablero contrachapado 350 < d < 450",null,null,"Roca natural porosa [por ejem. Lava] d < 1600"]
["Sellantes",null,null,null,null,null,"BH aligerado perforado con áridos ligeros 290 mm, muro de carga",null,null,null,null,null,"FR Entrevigado de hormigón - Canto 350 mm","FU Entrevigado de hormigón aligerado - Canto 400 mm","Hormigón con arcilla expandida sin otros áridos d 400",null,"Sin capa de compresión - Canto 300 mm","Tablero contrachapado 450 < d < 500",null,null,"Silex [2600 < d < 2800]"]
["Textiles",null,null,null,null,null,"BH aligerado perforado con áridos ligeros 290 mm, muro de carga con mortero aislante",null,null,null,null,null,"FR Entrevigado de hormigón - Canto 400 mm","FU Entrevigado de hormigón aligerado d < 1200 - Canto 250 mm","Hormigón con arcilla expandida sin otros áridos d 500",null,"Sin capa de compresión - Canto 350 mm","Tablero contrachapado 500 < d < 600",null,null,"Tierra apisonada adobe bloques de tierra comprimida [1770 < d < 2000]"]
["Vidrios",null,null,null,null,null,"BH aligerado perforado con áridos ligeros 80 mm",null,null,null,null,null,"FR Entrevigado de hormigón - Canto 450 mm","FU Entrevigado de hormigón aligerado d < 1200 - Canto 300 mm","Hormigón con arcilla expandida sin otros áridos d 600",null,"Sin capa de compresión - Canto 400 mm","Tablero contrachapado 600 < d < 750",null,null,"Tierra cruda con densidad 1000 Kg/m³"]
["Yesos",null,null,null,null,null,"BH aligerado perforado con áridos ligeros 90 mm",null,null,null,null,null,"FR Entrevigado de hormigón aligerado - Canto 250 mm","FU Entrevigado de hormigón aligerado d < 1200 - Canto 350 mm","Hormigón con arcilla expandida sin otros áridos d 700",null,"Sin capa de compresión - Canto 500 mm","Tablero contrachapado 700 < d < 900",null,null,"Tierra cruda con densidad 1200 Kg/m³"]
[null,null,null,null,null,null,"Bloque de picón aligerado de 120 mm con cámara doble",null,null,null,null,null,"FR Entrevigado de hormigón aligerado - Canto 300 mm","FU Entrevigado de hormigón aligerado d < 1200 - Canto 400 mm","Hormigón con áridos ligeros 1600 < d < 1800",null,null,"Tablero contrachapado d < 250",null,null,"Tierra cruda con densidad 1400 Kg/m³"]
[null,null,null,null,null,null,"Bloque de picón aligerado de 150 mm con cámara doble",null,null,null,null,null,"FR Entrevigado de hormigón aligerado - Canto 350 mm","FU Entrevigado de picón - Canto 300 mm","Hormigón con áridos ligeros 1800 < d < 2000",null,null,"Tablero de partículas 180 < d < 270",null,null,"Tierra cruda con densidad 1600 Kg/m³"]
[null,null,null,null,null,null,"Bloque de picón aligerado de 200 mm con cámara doble",null,null,null,null,null,"FR Entrevigado de hormigón aligerado - Canto 400 mm","FU Entrevigado de picón - Canto 350 mm","Hormigón con otros áridos ligeros d 1000",null,null,"Tablero de partículas 270 < d < 450",null,null,"Tierra cruda con densidad 1800 Kg/m³"]
[null,null,null,null,null,null,"Bloque de picón aligerado de 250 mm con cámara doble",null,null,null,null,null,"FR Entrevigado de hormigón aligerado - Canto 450 mm",null,"Hormigón con otros áridos ligeros d 1100",null,null,"Tablero de partículas 450 < d < 640",null,null,"Tierra cruda con densidad 2000 Kg/m³"]
[null,null,null,null,null,null,"Bloque de picón aligerado de 250 mm con cámara triple",null,null,null,null,null,"FR Entrevigado de hormigón d < 1200 con áridos ligeros - Canto 250 mm",null,"Hormigón con otros áridos ligeros d 1200",null,null,"Tablero de partículas 640 < d < 820",null,null,"Tierra cruda con densidad 800 Kg/m³"]
[null,null,null,null,null,null,"Bloque de picón aligerado de 90 mm con cámara simple",null,null,null,null,null,"FR Entrevigado de hormigón d < 1200 con áridos ligeros - Canto 300 mm",null,"Hormigón con otros áridos ligeros d 1300",null,null,"Tablero de partículas con cemento d = 1200",null,null,"Tierra vegetal [d < 2050]"]
[null,null,null,null,null,null,"Bloque de picón de 120 mm con cámara doble",null,null,null,null,null,"FR Entrevigado de hormigón d < 1200 con áridos ligeros - Canto 350 mm",null,"Hormigón con otros áridos ligeros d 1400",null,null,"Tablero de virutas orientadas [OSB] d < 650",null,null,"Traquita andesita [2000 < d < 2700]"]
[null,null,null,null,null,null,"Bloque de picón de 150 mm con cámara doble",null,null,null,null,null,"FR Entrevigado de hormigón d < 1200 con áridos ligeros - Canto 400 mm",null,"Hormigón con otros áridos ligeros d 1500",null,null,"Tableros de fibras incluyendo MDF 200 < d < 350"]
[null,null,null,null,null,null,"Bloque de picón de 200 mm con cámara doble",null,null,null,null,null,"FR Entrevigado de hormigón d < 1200 con áridos ligeros - Canto 450 mm",null,"Hormigón con otros áridos ligeros d 1600",null,null,"Tableros de fibras incluyendo MDF 350 < d < 550"]
[null,null,null,null,null,null,"Bloque de picón de 250 mm con cámara doble",null,null,null,null,null,"FR sin Entrevigado - Canto 250 mm",null,"Hormigón con otros áridos ligeros d 1800",null,null,"Tableros de fibras incluyendo MDF 550 < d < 750"]
[null,null,null,null,null,null,"Bloque de picón de 250 mm con cámara triple",null,null,null,null,null,"FR sin Entrevigado - Canto 300 mm",null,"Hormigón con otros áridos ligeros d 2000",null,null,"Tableros de fibras incluyendo MDF 750 < d < 1000"]
[null,null,null,null,null,null,"Bloque de picón de 90 mm con cámara simple",null,null,null,null,null,"FR sin Entrevigado - Canto 350 mm",null,"Hormigón con otros áridos ligeros d 500",null,null,"Tableros de fibras incluyendo MDF d < 200"]
[null,null,null,null,null,null,null,null,null,null,null,null,null,null,"Hormigón con otros áridos ligeros d 600"]
[null,null,null,null,null,null,null,null,null,null,null,null,null,null,"Hormigón con otros áridos ligeros d 700"]
[null,null,null,null,null,null,null,null,null,null,null,null,null,null,"Hormigón con otros áridos ligeros d 800"]
[null,null,null,null,null,null,null,null,null,null,null,null,null,null,"Hormigón con otros áridos ligeros d 900"]
[null,null,null,null,null,null,null,null,null,null,null,null,null,null,"Hormigón convencional d 1600"]
[null,null,null,null,null,null,null,null,null,null,null,null,null,null,"Hormigón convencional d 1700"]
[null,null,null,null,null,null,null,null,null,null,null,null,null,null,"Hormigón convencional d 1800"]
[null,null,null,null,null,null,null,null,null,null,null,null,null,null,"Hormigón convencional d 1900"]
[null,null,null,null,null,null,null,null,null,null,null,null,null,null,"Hormigón convencional d 2000"]
[null,null,null,null,null,null,null,null,null,null,null,null,null,null,"Hormigón convencional d 2100"]
[null,null,null,null,null,null,null,null,null,null,null,null,null,null,"Hormigón convencional d 2200"]
[null,null,null,null,null,null,null,null,null,null,null,null,null,null,"Hormigón convencional d 2300"]
[null,null,null,null,null,null,null,null,null,null,null,null,null,null,"Hormigón convencional d 2400"]
[null,null,null,null,null,null,null,null,null,null,null,null,null,null,"Hormigón en masa 2000 < d < 2300"]
[null,null,null,null,null,null,null,null,null,null,null,null,null,null,"Hormigón en masa 2300 < d < 2600"]
[null,null,null,null,null,null,null,null,null,null,null,null,null,null,"Teja de hormigón"]

{"sheet":"Auxiliar","index":5,"n_rows":95,"n_cols":71,"rows_kept":95,"cut":false,"hidden":true,"merged":[[0,0,0,7],[0,8,0,15],[1,0,1,3],[1,4,1,7],[2,0,2,1],[2,2,2,3],[2,4,2,5],[2,6,2,7],[2,10,2,11],[1,8,1,11],[1,12,1,15],[2,12,2,13],[2,14,2,15],[2,8,2,9],[18,30,18,32],[22,30,22,32],[2,24,2,25],[2,27,2,28],[27,19,27,22],[14,19,14,24]]}
["Suelos",null,null,null,null,null,null,null,"Resto"]
["Solución Proyecto",null,null,null,"Solución Alternativa",null,null,null,"Solución Proyecto",null,null,null,"Solución Alternativa"]
["Resistencias térmicas de aislamiento total\n(m²K/W)",null,"Resistencias térmicas de aislamiento Valero\n(m²K/W)",null,"Resistencias térmicas de aislamiento total\n(m²K/W)",null,"Resistencias térmicas de aislamiento Valero\n(m²K/W)",null,"Resistencias térmicas de aislamiento total\n(m²K/W)",null,"Resistencias térmicas de aislamiento Valero\n(m²K/W)",null,"Resistencias térmicas de aislamiento total\n(m²K/W)",null,"Resistencias térmicas de aislamiento Valero\n(m²K/W)",null,null,null,null,"Tipos cerramientos",null,"Rse","Rsi",null,"U Proyecto",null,null,"U Alternativa",null,null,null,"α","A","B","C","D","E",null,null,"Fachada","Cubierta","Suelo en contacto con el exterior","Muro en contacto con espacio no habitable","Cubierta en contacto con espacio no habitable","Suelo en contacto con espacio no habitable","Suelo en contacto con cámara sanitaria","Muro en contacto con el terreno","Cubierta enterrada","Suelo en contacto con el terreno"," ",null,"Fachada","Cubierta","Suelo en contacto con el exterior","Muro en contacto con espacio no habitable","Cubierta en contacto con espacio no habitable","Suelo en contacto con espacio no habitable","Suelo en contacto con cámara sanitaria","Muro en contacto con el terreno","Cubierta enterrada","Suelo en contacto con el terreno"," "]
[{"$f":"IFERROR((_xlfn._xlws.FILTER(AQ46:AQ67,(S46:S67=\"AislamientosValero\")+(S46:S67=\"Aislantes\"))),0)","v":0},null,{"$f":"IFERROR((_xlfn._xlws.FILTER(AQ46:AQ67,(S46:S67=\"AislamientosValero\"))),0)","v":0},null,{"$f":"IFERROR((_xlfn._xlws.FILTER(BS46:BS67,(AU46:AU67=\"AislamientosValero\")+(AU46:AU67=\"Aislantes\"))),0)","v":0},null,{"$f":"IFERROR((_xlfn._xlws.FILTER(BS46:BS67,(AU46:AU67=\"AislamientosValero\"))),0)","v":0},null,{"$f":"IFERROR((_xlfn._xlws.FILTER(AQ73:AQ94,(S73:S94=\"AislamientosValero\")+(S73:S94=\"Aislantes\"))),0)","v":0},null,{"$f":"IFERROR((_xlfn._xlws.FILTER(AQ73:AQ94,(S73:S94=\"AislamientosValero\"))),0)","v":0},null,{"$f":"IFERROR((_xlfn._xlws.FILTER(BS73:BS94,(AU73:AU94=\"AislamientosValero\")+(AU73:AU94=\"Aislantes\"))),0)","v":0},null,{"$f":"IFERROR((_xlfn._xlws.FILTER(BS73:BS94,(AU73:AU94=\"AislamientosValero\"))),0)","v":0},null,null,null,null,"Fachada",1,0.04,0.13,null,"Fachada",{"$f":"1/('Recop. Datos'!$D$18+AQ72+AQ95)","v":{"$error":"#N/A"}},null,"Fachada",{"$f":"1/('Recop. Datos'!$J$18+BS72+BS95)","v":{"$error":"#N/A"}},null,"Fachada",0.56000000000000005,0.5,0.38,0.28999999999999998,0.27,0.23,null,"Tipo de cerramiento","Muro","Cubierta","Suelo","Muro","Cubierta","Suelo","Suelo","Muro","Cubierta","Suelo"," ","Tipo de cerramiento","Muro","Cubierta","Suelo","Muro","Cubierta","Suelo","Suelo","Muro","Cubierta","Suelo"," "]
[null,null,null,null,null,null,null,null,null,null,null,null,null,null,null,null,null,null,null,"Cubierta",2,0.04,0.1,null,"Cubierta",{"$f":"1/('Recop. Datos'!$D$18+AQ72+AQ95)","v":{"$error":"#N/A"}},null,"Cubierta",{"$f":"1/('Recop. Datos'!$J$18+BS72+BS95)","v":{"$error":"#N/A"}},null,"Cubierta",0.5,0.44,0.33,0.23,0.22,0.19,null,"Contacto con","Exterior","Exterior","Exterior","Espacio no habitable","Espacio no habitable","Espacio no habitable","Cámara sanitaria","Terreno","Terreno","Terreno"," ","Contacto con","Exterior","Exterior","Exterior","Espacio no habitable","Espacio no habitable","Espacio no habitable","Cámara sanitaria","Terreno","Terreno","Terreno"," "]
[null,null,null,null,null,null,null,null,null,null,null,null,null,null,null,null,null,null,null,"Suelo en contacto con el exterior",3,0.04,0.17,null,"Suelo en contacto con el exterior",{"$f":"1/('Recop. Datos'!$A$18+AQ45+AQ68)","v":{"$error":"#N/A"}},null,"Suelo en contacto con el exterior",{"$f":"1/('Recop. Datos'!$G$18+BS45+BS68)","v":{"$error":"#N/A"}},null,"Suelo en contacto con el exterior",0.56000000000000005,0.5,0.38,0.28999999999999998,0.27,0.23,null,"Apartado","2.1.1","2.1.1","2.1.1","2.1.3.1","2.1.3.1","2.1.3.1","2.1.3.2","2.1.2.2","2.1.2.3","2.1.2.1"," ","Apartado","2.1.1","2.1.1","2.1.1","2.1.3.1","2.1.3.1","2.1.3.1","2.1.3.2","2.1.2.2","2.1.2.3","2.1.2.1"," "]
[null,null,null,null,null,null,null,null,null,null,null,null,null,null,null,null,null,null,null,"Muro en contacto con espacio no habitable",4,0.13,0.13,null,"Muro en contacto con espacio no habitable",{"$f":"IF(Cerramiento!G3=\"Estimados\",(X22*AF36),((VLOOKUP($X$17,Tabla7!$C$26:$E$31,3,FALSE))*X22))","v":{"$error":"#N/A"}},null,"Muro en contacto con espacio no habitable",{"$f":"IF(Cerramiento!G3=\"Estimados\",(Y22*AF36),((VLOOKUP($X$17,Tabla7V!$C$26:$E$31,3,FALSE))*Y22))","v":{"$error":"#N/A"}},null,"Muro en contacto con espacio no habitable",0.8,0.8,0.69,0.48,0.48,0.48,null,"R proy","R de Proyecto (m²K/W)","R de Proyecto (m²K/W)","R de Proyecto (m²K/W)","R de Proyecto (m²K/W)","R de Proyecto (m²K/W)","R de Proyecto (m²K/W)","R de Proyecto (m²K/W)","R de Proyecto (m²K/W)","R de Proyecto (m²K/W)",{"$f":"IF(W32=0,\"Ra de Proyecto (m²K/W)\",\"Rf de Proyecto (m²K/W)\")","v":"Ra de Proyecto (m²K/W)"}," ","R proy",{"$f":"'Recop. Datos'!$D$18","v":0},{"$f":"'Recop. Datos'!$D$18","v":0},{"$f":"'Recop. Datos'!$D$18","v":0},{"$f":"'Recop. Datos'!$D$18","v":0},{"$f":"'Recop. Datos'!$D$18","v":0},{"$f":"'Recop. Datos'!$D$18","v":0},{"$f":"'Recop. Datos'!$D$18","v":0},{"$f":"'Recop. Datos'!$D$18","v":0},{"$f":"'Recop. Datos'!$D$18","v":0},{"$f":"IF(W32=0,'Recop. Datos'!D8,'Recop. Datos'!D18)","v":0}," "]
[null,null,null,null,null,null,null,null,null,null,null,null,null,null,null,null,null,null,null,"Cubierta en contacto con espacio no habitable",5,0.1,0.1,null,"Cubierta en contacto con espacio no habitable",{"$f":"IF(Cerramiento!G3=\"Estimados\",(X23*AF36),((VLOOKUP($X$17,Tabla7!$C$26:$E$31,3,FALSE))*X23))","v":{"$error":"#N/A"}},null,"Cubierta en contacto con espacio no habitable",{"$f":"IF(Cerramiento!G3=\"Estimados\",(Y23*AF36),((VLOOKUP($X$17,Tabla7V!$C$26:$E$31,3,FALSE))*Y23))","v":{"$error":"#N/A"}},null,"Cubierta en contacto con espacio no habitable",0.8,0.8,0.69,0.48,0.48,0.48,null,"R prop","R de la Alternativa (m²K/W)","R de la Alternativa (m²K/W)","R de la Alternativa (m²K/W)","R de la Alternativa (m²K/W)","R de la Alternativa (m²K/W)","R de la Alternativa (m²K/W)","R de la Alternativa (m²K/W)","R de la Alternativa (m²K/W)","R de la Alternativa (m²K/W)",{"$f":"IF(W32=0,\"Ra de la Alternativa (m²K/W)\",\"Rf de la Alternativa (m²K/W)\")","v":"Ra de la Alternativa (m²K/W)"}," ","R prop",{"$f":"'Recop. Datos'!$G$18","v":0},{"$f":"'Recop. Datos'!$G$18","v":0},{"$f":"'Recop. Datos'!$G$18","v":0},{"$f":"'Recop. Datos'!$G$18","v":0},{"$f":"'Recop. Datos'!$G$18","v":0},{"$f":"'Recop. Datos'!$G$18","v":0},{"$f":"'Recop. Datos'!$G$18","v":0},{"$f":"'Recop. Datos'!$G$18","v":0},{"$f":"'Recop. Datos'!$G$18","v":0},{"$f":"IF(W32=0,'Recop. Datos'!G8,'Recop. Datos'!G18)","v":0}," "]
[null,null,null,null,null,null,null,null,null,null,null,null,null,null,null,null,null,null,null,"Suelo en contacto con espacio no habitable",6,0.17,0.17,null,"Suelo en contacto con espacio no habitable",{"$f":"IF(Cerramiento!G3=\"Estimados\",(X24*AF36),((VLOOKUP($X$17,Tabla7!$C$26:$E$31,3,FALSE))*X24))","v":{"$error":"#N/A"}},null,"Suelo en contacto con espacio no habitable",{"$f":"IF(Cerramiento!G3=\"Estimados\",(Y24*AF36),((VLOOKUP($X$17,Tabla7V!$C$26:$E$31,3,FALSE))*Y24))","v":{"$error":"#N/A"}},null,"Suelo en contacto con espacio no habitable",0.8,0.8,0.69,0.48,0.48,0.48,null,"Dato 1",null,null,null,"Nivel de estanqueidad","Nivel de estanqueidad","Nivel de estanqueidad","A (m²)","z (m)","e (m)","z (m)"," ","Valor 1",null,null,null,{"$f":"IF(Cerramiento!G3=\"Estimados\",\"Estimado\",'Datos necesarios'!$H$11)","v":0},{"$f":"IF(Cerramiento!G3=\"ESTIMADOS\",\"Estimado\",'Datos necesarios'!$H$11)","v":0},{"$f":"IF(Cerramiento!G3=\"ESTIMADOS\",\"Estimado\",'Datos necesarios'!$H$11)","v":0},{"$f":"IF(Cerramiento!G3=\"ESTIMADOS\",\"Estimado\",'Datos necesarios'!$R$24)","v":0},{"$f":"IF(Cerramiento!G3=\"ESTIMADOS\",AF34,'Datos necesarios'!$R$35)","v":0},{"$f":"IF(Cerramiento!G3=\"ESTIMADOS\",AF35,'Datos necesarios'!$H$35)","v":0},{"$f":"IF(Cerramiento!G3=\"ESTIMADOS\",AF33,'Datos necesarios'!$H$26)","v":0}," "]
[null,null,null,null,null,null,null,null,null,null,null,null,null,null,null,null,null,null,null,"Suelo en contacto con cámara sanitaria",7,0,0,null,"Suelo en contacto con cámara sanitaria",{"$f":"Tabla9!H56","v":0},null,"Suelo en contacto con cámara sanitaria",{"$f":"Tabla9V!H56","v":0},null,"Suelo en contacto con cámara sanitaria",0.8,0.8,0.69,0.48,0.48,0.48,null,"Dato 2",null,null,null,"Caso","Caso","Caso","P (m)",null,null,"Caso"," ","Valor 2",null,null,null,{"$f":"IF(W17=1,\"Caso 1\",(IF(W17=2,\"Caso 2\",\"Estimado\")))","v":"Estimado"},{"$f":"IF(W17=1,\"Caso 1\",(IF(W17=2,\"Caso 2\",\"Estimado\")))","v":"Estimado"},{"$f":"IF(W17=1,\"Caso 1\",(IF(W17=2,\"Caso 2\",\"Estimado\")))","v":"Estimado"},{"$f":"IF(Cerramiento!G3=\"ESTIMADOS\",\"Estimado\",'Datos necesarios'!$R$26)","v":0},null,null,{"$f":"IF(W32=0,\"Caso 1\",(IF(W32<>0,\"Caso 2\",\"\")))","v":"Caso 1"}," "]
[null,null,null,null,null,null,null,null,null,null,null,null,null,null,null,null,null,null,null,"Muro en contacto con el terreno",8,0,0,null,"Muro en contacto con el terreno",{"$f":"Tabla5!H50","v":4.8},null,"Muro en contacto con el terreno",{"$f":"Tabla5V!H50","v":4.8},null,"Muro en contacto con el terreno",0.8,0.8,0.69,0.48,0.48,0.48,null,"Dato 3",null,null,null,"Ah-nh/Anh-e","Ah-nh/Anh-e","Ah-nh/Anh-e","B' = A/((1/2)*P)",null,null,"A (m²)"," ","Valor 3",null,null,null,{"$f":"IF(Cerramiento!G3=\"ESTIMADOS\",\"Estimado\",Tabla7!$B$26)","v":0},{"$f":"IF(Cerramiento!G3=\"ESTIMADOS\",\"Estimado\",Tabla7!$B$26)","v":0},{"$f":"IF(Cerramiento!G3=\"ESTIMADOS\",\"Estimado\",Tabla7!$B$26)","v":0},{"$f":"IF(Cerramiento!G3=\"ESTIMADOS\",AF31,'Datos necesarios'!$R$28)","v":""},null,null,{"$f":"IF(Cerramiento!G3=\"ESTIMADOS\",\"Estimado\",'Datos necesarios'!$H$20)","v":0}," "]
[null,null,null,null,null,null,null,null,null,null,null,null,null,null,null,null,null,null,null,"Cubierta enterrada",9,0.04,0.1,null,"Cubierta enterrada",{"$f":"IF(Cerramiento!G3=\"Estimados\",(1/('Recop. Datos'!$D$18+Auxiliar!V12+Auxiliar!W12+(IF((OR($AP$67=\"-\",$AP$73=\"-\")),0,1/2)))),(1/('Recop. Datos'!$D$18+Auxiliar!V12+Auxiliar!W12+(IF((OR($AP$67=\"-\",$AP$73=\"-\")),0,'Datos necesarios'!H35/2)))))","v":7.1428571428571423},null,"Cubierta enterrada",{"$f":"IF(Cerramiento!G3=\"Estimados\",(1/('Recop. Datos'!$G$18+Auxiliar!V12+Auxiliar!W12+(IF((OR($BR$67=\"-\",$BR$73=\"-\")),0,1/2)))),(1/('Recop. Datos'!$G$18+Auxiliar!V12+Auxiliar!W12+(IF((OR($BR$67=\"-\",$BR$73=\"-\")),0,'Datos necesarios'!H35/2)))))","v":7.1428571428571423},null,"Cubierta enterrada",0.8,0.8,0.69,0.48,0.48,0.48,null,"Dato 4",null,null,null,"Posición del aislamiento","Posición del aislamiento","Posición del aislamiento",null,null,null,"P (m)"," ","Valor 4",null,null,null,{"$f":"IF(Cerramiento!G3=\"ESTIMADOS\",$S$23,(VLOOKUP('Datos necesarios'!$F$13,$R$23:$S$25,2,FALSE)))","v":{"$error":"#N/A"}},{"$f":"IF(Cerramiento!G3=\"ESTIMADOS\",$S$23,(VLOOKUP('Datos necesarios'!$F$13,$R$23:$S$25,2,FALSE)))","v":{"$error":"#N/A"}},{"$f":"IF(Cerramiento!G3=\"ESTIMADOS\",$S$23,(VLOOKUP('Datos necesarios'!$F$13,$R$23:$S$25,2,FALSE)))","v":{"$error":"#N/A"}},null,null,null,{"$f":"IF(Cerramiento!G3=\"ESTIMADOS\",\"Estimado\",'Datos necesarios'!$H$22)","v":0}," "]
[null,null,null,null,null,null,null,null,null,null,null,null,null,null,null,null,null,null,null,"Suelo en contacto con el terreno",10,0,0,null,"Suelo en contacto con el terreno",{"$f":"IF(W32=0,(VLOOKUP($W$30,Tabla3!$F$40:$H$43,3,FALSE)),(VLOOKUP($W$32,Tabla4!$F$40:$H$43,3,FALSE)))","v":{"$error":"#N/A"}},null,"Suelo en contacto con el terreno",{"$f":"IF(W32=0,(VLOOKUP($W$30,Tabla3V!$F$40:$H$43,3,FALSE)),(VLOOKUP($W$32,Tabla4V!$F$40:$H$43,3,FALSE)))","v":{"$error":"#N/A"}},null,"Suelo en contacto con el terreno",0.8,0.8,0.69,0.48,0.48,0.48,null,"Dato 5",null,null,null,"b","b","b",null,null,null,"B' = A/((1/2)*P)"," ","Valor 5",null,null,null,{"$f":"IF(Cerramiento!G3=\"ESTIMADOS\",AF36,(VLOOKUP($X$17,Tabla7!$C$26:$E$31,3,FALSE)))","v":{"$error":"#N/A"}},{"$f":"IF(Cerramiento!G3=\"ESTIMADOS\",AF36,(VLOOKUP($X$17,Tabla7!$C$26:$E$31,3,FALSE)))","v":{"$error":"#N/A"}},{"$f":"IF(Cerramiento!G3=\"ESTIMADOS\",AF36,(VLOOKUP($X$17,Tabla7!$C$26:$E$31,3,FALSE)))","v":{"$error":"#N/A"}},null,null,null,{"$f":"IF(Cerramiento!G3=\"ESTIMADOS\",AF31,'Datos necesarios'!$H$24)","v":""}," "]
[null,null,null,null,null,null,null,null,null,null,null,null,null,null,null,null,null,null,null,null,null,null,null,null,null,null,null,null,null,null,null,null,null,null,null,null,null,null,"Dato 6",null,null,null,"Up de Proyecto (W/m²K)","Up de Proyecto (W/m²K)","Up de Proyecto (W/m²K)",null,null,null,"Tipo de aislamiento"," ","Valor 6",null,null,null,{"$f":"X22","v":3.8461538461538458},{"$f":"X23","v":5},{"$f":"X24","v":2.9411764705882351},null,null,null,{"$f":"IF(Cerramiento!G3=\"ESTIMADOS\",$S$34,(VLOOKUP('Datos necesarios'!$F$28,$R$30:$S$34,2,FALSE)))","v":{"$error":"#N/A"}}," "]
[null,null,null,null,null,null,null,null,null,null,null,null,null,null,null,null,null,null,null,"Espacios no habitables",null,null,null,null,null,null,null,null,null,null,null," Zona α","Zona A","Zona B","Zona C","Zona D","Zona E",null,"Dato 7",null,null,null,"Up de la Alternativa (W/m²K)","Up de la Alternativa (W/m²K)","Up de la Alternativa (W/m²K)",null,null,null,null," ","Valor 7",null,null,null,{"$f":"Y22","v":3.8461538461538458},{"$f":"Y23","v":5},{"$f":"Y24","v":2.9411764705882351},null,null,null,null," "]
[null,null,null,null,null,null,null,null,null,null,null,null,null,null,null,null,null,null,null,"Niveles de estanqueidad",null,null,null,null,null,null,null,null,null,null,{"$f":"AA17","v":0},{"$f":"VLOOKUP($AE$16,$AE$4:$AK$13,2,FALSE)","v":{"$error":"#N/A"}},{"$f":"VLOOKUP($AE$16,$AE$4:$AK$13,3,FALSE)","v":{"$error":"#N/A"}},{"$f":"VLOOKUP($AE$16,$AE$4:$AK$13,4,FALSE)","v":{"$error":"#N/A"}},{"$f":"VLOOKUP($AE$16,$AE$4:$AK$13,5,FALSE)","v":{"$error":"#N/A"}},{"$f":"VLOOKUP($AE$16,$AE$4:$AK$13,6,FALSE)","v":{"$error":"#N/A"}},{"$f":"VLOOKUP($AE$16,$AE$4:$AK$13,7,FALSE)","v":{"$error":"#N/A"}},null,"Tabla",null,null,null,"Tabla utilizada","Tabla utilizada","Tabla utilizada","Tabla utilizada","Tabla utilizada",null,"Tabla utilizada"," ",null,null,null,null,"Tabla 7","Tabla 7","Tabla 7","Tabla 9","Tabla 5",null,{"$f":"IF(W32=0,\"Tabla 3\",\"Tabla 4\")","v":"Tabla 3"}]
[null,null,null,null,null,null,null,null,null,null,null,null,null,null,null,null,null,null,null,"Nivel 1",1,null,{"$f":"IFERROR((VLOOKUP('Datos necesarios'!H11,Auxiliar!T17:U21,2,FALSE)),\"\")","v":""},{"$f":"CONCATENATE(W17,W18)","v":""},null,null,{"$f":"Cerramiento!D3","v":0},null,null,null,null,null,null,null,null,null,null,null,"Comentario",{"$f":"CONCATENATE(\"El cálculo de la transmitancia térmica U se obtiene de la inversa de la suma de las resistencias térmicas de los materiales R más las resistencias térmicas superficiales de la Tabla 1. \",IF((OR($AP$67=\"-\",$AP$73=\"-\",$BR$66=\"-\",$BR$73=\"-\")),$AN$23,\"\"))","v":"El cálculo de la transmitancia térmica U se obtiene de la inversa de la suma de las resistencias térmicas de los materiales R más las resistencias térmicas superficiales de la Tabla 1. "},{"$f":"CONCATENATE(\"El cálculo de la transmitancia térmica U se obtiene de la inversa de la suma de las resistencias térmicas de los materiales R más las resistencias térmicas superficiales de la Tabla 1. \",IF((OR($AP$67=\"-\",$AP$73=\"-\",$BR$66=\"-\",$BR$73=\"-\")),$AN$23,\"\"))","v":"El cálculo de la transmitancia térmica U se obtiene de la inversa de la suma de las resistencias térmicas de los materiales R más las resistencias térmicas superficiales de la Tabla 1. "},{"$f":"CONCATENATE(\"El cálculo de la transmitancia térmica U se obtiene de la inversa de la suma de las resistencias térmicas de los materiales R más las resistencias térmicas superficiales de la Tabla 1. \",IF((OR($AP$67=\"-\",$AP$73=\"-\",$BR$66=\"-\",$BR$73=\"-\")),$AN$23,\"\"))","v":"El cálculo de la transmitancia térmica U se obtiene de la inversa de la suma de las resistencias térmicas de los materiales R más las resistencias térmicas superficiales de la Tabla 1. "},"El cálculo de la transmitancia térmica U se obtiene de la multiplicación de Up y b. Up se obtiene de la inversa de la suma de las resistencia térmicas de los materiales R más las resistencias térmicas superficiales de la Tabla 6. El coeficiente b se obtiene de la tabla 7 entrando con Ah-nh/Anh-e, la posición del aislamiento y el caso que corresponde en función del nivel de estanqueidad del espacio no habitable. Todos los valores intermiedios se obtienen mediante interpolación lineal.","El cálculo de la transmitancia térmica U se obtiene de la multiplicación de Up y b. Up se obtiene de la inversa de la suma de las resistencia térmicas de los materiales R más las resistencias térmicas superficiales de la Tabla 6. El coeficiente b se obtiene de la tabla 7 entrando con Ah-nh/Anh-e, la posición del aislamiento y el caso que corresponde en función del nivel de estanqueidad del espacio no habitable. Todos los valores intermiedios se obtienen mediante interpolación lineal.","El cálculo de la transmitancia térmica U se obtiene de la multiplicación de Up y b. Up se obtiene de la inversa de la suma de las resistencia térmicas de los materiales R más las resistencias térmicas superficiales de la Tabla 6. El coeficiente b se obtiene de la tabla 7 entrando con Ah-nh/Anh-e, la posición del aislamiento y el caso que corresponde en función del nivel de estanqueidad del espacio no habitable. Todos los valores intermiedios se obtienen mediante interpolación lineal.","El cálculo de la transmitancia térmica U se obtiene de la tabla 9 entrando con la longitud característica B' y la resistencia térmica del suelo Rf despreciando las resistencias térmicas superficiales. Todos los valores intermiedios se obtienen mediante interpolación lineal.","El cálculo de la transmitancia térmica U se obtiene de la tabla 5 entrando con la profundidad z y la resistencia térmica del muro Rm despreciando las resistencias térmicas superficiales. Todos los valores intermiedios se obtienen mediante interpolación lineal.",{"$f":"CONCATENATE(\"El cálculo de la transmitancia térmica U se obtiene calculando como una cubierta con el exterior (apartado 2.1.1) considerando el terreno como otra capa térmicamente homogénea, con espesor e, de conductividad térmica λ = 2 W/mK. \",IF((OR($AP$67=\"-\",$AP$73=\"-\",$BR$66=\"-\",$BR$73=\"-\")),$AN$23,\"\"))","v":"El cálculo de la transmitancia térmica U se obtiene calculando como una cubierta con el exterior (apartado 2.1.1) considerando el terreno como otra capa térmicamente homogénea, con espesor e, de conductividad térmica λ = 2 W/mK. "},{"$f":"IF(W32=0,AW18,(IF(W32<>0,AW19,\"\")))","v":"El cálculo de la transmitancia térmica U se obtiene de la tabla 3 en función del tipo de colocación del aislamiento, de la resistencia térmica del aislamiento Ra y la longitud característica B'. Todos los valores intermiedios se obtienen mediante interpolación lineal."}," "]
[null,null,null,null,null,null,null,null,null,null,null,null,null,null,null,null,null,null,null,"Nivel 2",1,null,{"$f":"IFERROR((VLOOKUP('Datos necesarios'!F13:H13,Auxiliar!T23:U25,2,FALSE)),\"\")","v":""},"","",null,null,null,null,null,null,null,null,null,null,null,null,null,null,null,null,null,null,null,null,null,null,null,"El cálculo de la transmitancia térmica U se obtiene de la tabla 3 en función del tipo de colocación del aislamiento, de la resistencia térmica del aislamiento Ra y la longitud característica B'. Todos los valores intermiedios se obtienen mediante interpolación lineal."," "]
[null,null,null,null,null,null,null,null,null,null,null,null,null,null,null,null,null,null,null,"Nivel 3",1,null,null,null,null,null,null,"U PROYECTO",null,null,"Proyecto",null,null,null,null,null,null,null,null,null,null,null,null,null,null,null,null,null,"El cálculo de la transmitancia térmica U se obtiene de la tabla 4 en función de la profundidad z a la que apoya el suelo respecto el nivel del terreno, de la resistencia térmica del suelo Rf y la longitud característica B'. Todos los valores intermiedios se obtienen mediante interpolación lineal."," "]
[null,null,null,null,null,null,null,null,null,null,null,null,null,null,null,null,null,null,null,"Nivel 4",2,null,null,null,null,null,null,{"$f":"IFERROR((ROUND((VLOOKUP(AA17,Y4:Z13,2,FALSE)),2)),\"Faltan datos\")","v":"Faltan datos"},null,null,"Valero","Otro","Resto"]
[null,null,null,null,null,null,null,null,null,null,null,null,null,null,null,null,null,null,null,"Nivel 5",2,null,null,"Up proy","Up prop",null,null,null,null,null,{"$f":"'Recop. Datos'!D28","v":{"$error":"#DIV/0!"}},{"$f":"'Recop. Datos'!D33","v":{"$error":"#DIV/0!"}},{"$f":"1-'Recop. Datos'!D28-'Recop. Datos'!D33","v":{"$error":"#DIV/0!"}}]
[null,null,null,null,null,null,null,null,null,null,null,null,null,null,null,null,null,null,null,"Aislamiento",null,null,"MURO",{"$f":"1/('Recop. Datos'!$D$18+Auxiliar!V7+Auxiliar!W7)","v":3.8461538461538458},{"$f":"1/('Recop. Datos'!$J$18+Auxiliar!V7+Auxiliar!W7)","v":3.8461538461538458},null,null,"U ALTERNATIVA"]
[null,null,null,null,null,null,null,null,null,null,null,null,null,null,null,null,null,"Entre espacio habitable y no habitable","Entre H-NH","Entre espacio habitable y no habitable",1,null,"CUB",{"$f":"1/('Recop. Datos'!$D$18+Auxiliar!V8+Auxiliar!W8)","v":5},{"$f":"1/('Recop. Datos'!$J$18+Auxiliar!V8+Auxiliar!W8)","v":5},null,null,{"$f":"IFERROR((ROUND((VLOOKUP(AA17,AB4:AC13,2,FALSE)),2)),\"Faltan datos\")","v":"Faltan datos"},null,null,"Proyecto",null,null,null,null,null,null,null,null,"Para cámaras de aire ventiladas, la resistencia térmica total del cerramiento se obtiene despreciando la resistencia térmica de la cámara de aire y las de las demás capas entre la cámara de aire y el ambiente exterior, e incluyendo una resistencia superficial exterior correspondiente al aire en calma, igual a la resistencia superficial interior del mismo elemento. "]
[null,null,null,null,null,null,null,null,null,null,null,null,null,null,null,null,null,"Entre espacio no habitable y el exterior","Entre E-NH","Entre espacio no habitable y el exterior",3,null,"SUELO",{"$f":"1/('Recop. Datos'!$A$18+Auxiliar!V9+Auxiliar!W9)","v":2.9411764705882351},{"$f":"1/('Recop. Datos'!$G$18+Auxiliar!V9+Auxiliar!W9)","v":2.9411764705882351},null,null,null,null,null,"Valero","Otro","Resto"]
[null,null,null,null,null,null,null,null,null,null,null,null,null,null,null,null,null,"Sin aislamiento térmico","Sin aislam.","Sin aislamiento térmico",2,null,null,null,null,null,null,null,null,null,{"$f":"'Recop. Datos'!G28","v":{"$error":"#DIV/0!"}},{"$f":"'Recop. Datos'!G33","v":{"$error":"#DIV/0!"}},{"$f":"1-'Recop. Datos'!G28-'Recop. Datos'!G33","v":{"$error":"#DIV/0!"}}]
[]
[]
[null,null,null,null,null,null,null,null,null,null,null,null,null,null,null,null,null,null,null,"Suelo terreno",null,null,null,null,"DATOS NECESARIOS"]
[null,null,null,null,null,null,null,null,null,null,null,null,null,null,null,null,null,null,null,"Aislamiento",null,null,null,null,"Estimados"]
[null,null,null,null,null,null,null,null,null,null,null,null,null,null,null,null,null,"Sin aislamiento térmico","Sin aislam.","Sin aislamiento térmico",1,null,{"$f":"IF(Cerramiento!G3=\"Estimados\",4,(VLOOKUP('Datos necesarios'!F28,Auxiliar!T30:U34,2,FALSE)))","v":{"$error":"#N/A"}},null,"Conocidos",null,null,null,null,null,"Datos estimados"]
[null,null,null,null,null,null,null,null,null,null,null,null,null,null,null,null,null,"Banda perimetral 0,5 m","D = 0,5 m","Banda perimetral 0,5 m",2,null,null,null,null,null,null,null,null,null,"B'",5]
[null,null,null,null,null,null,null,null,null,null,null,null,null,null,null,null,null,"Banda perimetral 1,0 m","D = 1,0 m","Banda perimetral 1,0 m",3,null,{"$f":"IF(Cerramiento!G3=\"Estimados\",0,(MAX(V36:V39)))","v":0},null,{"$f":"IFERROR((IF('Recop. Datos'!D8=0,(IF((AND(Cerramiento!D3=\"Suelo en contacto con el terreno\",(OR(Auxiliar!W30=2,Auxiliar!W30=3)))),\"Introducir aislamiento de la banda en el cerramiento\",\"\")),\"\")),\"\")","v":""},null,null,null,null,null,"Caso","Caso 1"]
[null,null,null,null,null,null,null,null,null,null,null,null,null,null,null,null,null,"Banda perimetral ≥ 1,5 m","D ≥ 1,5 m","Banda perimetral ≥ 1,5 m",4,null,null,null,{"$f":"IFERROR((IF('Recop. Datos'!G8=0,(IF((AND(Cerramiento!D3=\"Suelo en contacto con el terreno\",(OR(Auxiliar!W30=2,Auxiliar!W30=3)))),\"Introducir aislamiento de la banda en el cerramiento\",\"\")),\"\")),\"\")","v":""},null,null,null,null,null,"z suelo",0.5]
[null,null,null,null,null,null,null,null,null,null,null,null,null,null,null,null,null,"Toda la superficie aislada","D ≥ 1,5 m","Toda la superficie aislada",4,null,null,null,null,null,null,null,null,null,"z muro",2.5]
[null,null,null,null,null,null,null,null,null,null,null,null,null,null,null,null,null,null,null,"Profundidad",null,null,null,null,null,null,null,null,null,null,"e cubierta",1]
[null,null,null,null,null,null,null,null,null,null,null,null,null,null,null,null,null,null,null,0.5,1,{"$f":"IF((AND('Datos necesarios'!H26>Auxiliar!T36,'Datos necesarios'!H26<=Auxiliar!U36)),1,\"\")","v":""},null,null,null,null,null,null,null,null,"b",0.93]
[null,null,null,null,null,null,null,null,null,null,null,null,null,null,null,null,null,null,null,1,2,{"$f":"IF((AND('Datos necesarios'!H26>Auxiliar!T37,'Datos necesarios'!H26<=Auxiliar!U37)),2,\"\")","v":""}]
[null,null,null,null,null,null,null,null,null,null,null,null,null,null,null,null,null,null,null,2,3,{"$f":"IF((AND('Datos necesarios'!H26>Auxiliar!T38,'Datos necesarios'!H26<=Auxiliar!U38)),3,\"\")","v":""}]
[null,null,null,null,null,null,null,null,null,null,null,null,null,null,null,null,null,null,null,3,100000,{"$f":"IF((AND('Datos necesarios'!H26>Auxiliar!T39,'Datos necesarios'!H26<=Auxiliar!U39)),4,\"\")","v":""}]
[]
[]
[null,null,null,null,null,null,null,null,null,null,null,null,null,null,null,null,null,"Solución de Proyecto",null,null,null,null,null,null,null,null,null,null,null,null,null,null,null,null,null,null,null,null,null,null,null,null,null,null,null,"Solución Alternativa"]
[]
[null,null,null,null,null,null,null,null,null,null,null,null,null,null,null,null,null,null,"Suelos",null,null,null,null,null,null,null,null,null,null,null,null,null,null,null,null,null,null,null,null,null,null,null,null,null,null,null,"Suelos"]
[null,null,null,null,null,null,null,null,null,null,null,null,null,null,null,null,null,null,null,null,null,null,null,null,null,null,null,null,null,null,null,null,null,null,null,null,null,null,null,null,null,"Rsi",{"$f":"VLOOKUP(Cerramiento!$D$3,$T$4:$W$13,4,FALSE)","v":{"$error":"#N/A"}},null,null,null,null,null,null,null,null,null,null,null,null,null,null,null,null,null,null,null,null,null,null,null,null,null,null,"Rsi",{"$f":"VLOOKUP(Cerramiento!$D$3,$T$4:$W$13,4,FALSE)","v":{"$error":"#N/A"}}]
[null,null,null,null,null,null,null,null,null,null,null,null,null,null,null,null,null,null,{"$f":"Cerramiento!C10","v":0},{"$f":"Cerramiento!D10","v":0},{"$f":"Cerramiento!H10","v":""},{"$f":"IF(U45=\"-\",\"-\",U46)","v":""},{"$f":"IF(V45=\"-\",\"-\",V46)","v":""},"","","","","","","","","","","","","","",{"$f":"IF(AK45=\"-\",\"-\",AK46)","v":""},{"$f":"IF(AL45=\"-\",\"-\",AL46)","v":""},"","","",{"$f":"IF(AP46=\"-\",0,AP46)","v":""},null,null,null,{"$f":"Cerramiento!C37","v":0},{"$f":"Cerramiento!D37","v":0},{"$f":"Cerramiento!H37","v":""},{"$f":"IF(AW45=\"-\",\"-\",AW46)","v":""},{"$f":"IF(AX45=\"-\",\"-\",AX46)","v":""},"","","","","","","","","","","","","","",{"$f":"IF(BM45=\"-\",\"-\",BM46)","v":""},{"$f":"IF(BN45=\"-\",\"-\",BN46)","v":""},"","","",{"$f":"IF(BR46=\"-\",0,BR46)","v":""}]
[null,null,null,null,null,null,null,null,null,null,null,null,null,null,null,null,null,null,{"$f":"Cerramiento!C11","v":0},{"$f":"Cerramiento!D11","v":0},{"$f":"Cerramiento!H11","v":""},{"$f":"IF(U46=\"-\",\"-\",U47)","v":""},{"$f":"IF(V46=\"-\",\"-\",V47)","v":""},"","","","","","","","","","","","","","",{"$f":"IF(AK46=\"-\",\"-\",AK47)","v":""},"","","","",{"$f":"IF(AP47=\"-\",0,AP47)","v":""},null,null,null,{"$f":"Cerramiento!C38","v":0},{"$f":"Cerramiento!D38","v":0},{"$f":"Cerramiento!H38","v":""},{"$f":"IF(AW46=\"-\",\"-\",AW47)","v":""},"","","","","","","","","","","","","","","","",{"$f":"IF(BN46=\"-\",\"-\",BN47)","v":""},"","","",{"$f":"IF(BR47=\"-\",0,BR47)","v":""}]
[null,null,null,null,null,null,null,null,null,null,null,null,null,null,null,null,null,null,{"$f":"Cerramiento!C12","v":0},{"$f":"Cerramiento!D12","v":0},{"$f":"Cerramiento!H12","v":""},"","","","","","","","","","","","","","","","","","","","","","",null,null,null,{"$f":"Cerramiento!C39","v":0},{"$f":"Cerramiento!D39","v":0},{"$f":"Cerramiento!H39","v":""},"","","","","","","","","","","","","","","","","",{"$f":"IF(BN47=\"-\",\"-\",BN48)","v":""},"","","",""]
[null,null,null,null,null,null,null,null,null,null,null,null,null,null,null,null,null,null,{"$f":"Cerramiento!C13","v":0},{"$f":"Cerramiento!D13","v":0},{"$f":"Cerramiento!H13","v":""},"","","","","","","","","","","","","","","","","","","","","","",null,null,null,{"$f":"Cerramiento!C40","v":0},{"$f":"Cerramiento!D40","v":0},{"$f":"Cerramiento!H40","v":""},"","","","","","","","","","","","","","","","","",{"$f":"IF(BN48=\"-\",\"-\",BN49)","v":""},"","","",""]
[null,null,null,null,null,null,null,null,null,null,null,null,null,null,null,null,null,null,{"$f":"Cerramiento!C14","v":0},{"$f":"Cerramiento!D14","v":0},{"$f":"Cerramiento!H14","v":""},"","","","","","","","","","","","","","","","","","","","","","",null,null,null,{"$f":"Cerramiento!C41","v":0},{"$f":"Cerramiento!D41","v":0},{"$f":"Cerramiento!H41","v":""},"","","","","","","","","","","","","","","","","",{"$f":"IF(BN49=\"-\",\"-\",BN50)","v":""},"","","",""]
[null,null,null,null,null,null,null,null,null,null,null,null,null,null,null,null,null,null,{"$f":"Cerramiento!C15","v":0},{"$f":"Cerramiento!D15","v":0},{"$f":"Cerramiento!H15","v":""},"","","","","","","","","","","","","","","","","","","","","","",null,null,null,{"$f":"Cerramiento!C42","v":0},{"$f":"Cerramiento!D42","v":0},{"$f":"Cerramiento!H42","v":""},"","","","","","","","","","","","","","","","","",{"$f":"IF(BN50=\"-\",\"-\",BN51)","v":""},"","","",""]
[null,null,null,null,null,null,null,null,null,null,null,null,null,null,null,null,null,null,{"$f":"Cerramiento!C16","v":0},{"$f":"Cerramiento!D16","v":0},{"$f":"Cerramiento!H16","v":""},"","","","","","","","","","","","","","","","","","","","","","",null,null,null,{"$f":"Cerramiento!C43","v":0},{"$f":"Cerramiento!D43","v":0},{"$f":"Cerramiento!H43","v":""},"","","","","","","","","","","","","","","","","",{"$f":"IF(BN51=\"-\",\"-\",BN52)","v":""},"","","",""]
[null,null,null,null,null,null,null,null,null,null,null,null,null,null,null,null,null,null,{"$f":"Cerramiento!C17","v":0},{"$f":"Cerramiento!D17","v":0},{"$f":"Cerramiento!H17","v":""},"","","","","","","","","","","","","","","","","","","","","","",null,null,null,{"$f":"Cerramiento!C44","v":0},{"$f":"Cerramiento!D44","v":0},{"$f":"Cerramiento!H44","v":""},"","","","","","","","","","","","","","","","","",{"$f":"IF(BN52=\"-\",\"-\",BN53)","v":""},"","","",""]
[null,null,null,null,null,null,null,null,null,null,null,null,null,null,null,null,null,null,{"$f":"Cerramiento!C18","v":0},{"$f":"Cerramiento!D18","v":0},{"$f":"Cerramiento!H18","v":""},"","","","","","","","","","","","","","","","","","","","","","",null,null,null,{"$f":"Cerramiento!C45","v":0},{"$f":"Cerramiento!D45","v":0},{"$f":"Cerramiento!H45","v":""},"","","","","","","","","","","","","","","","","",{"$f":"IF(BN53=\"-\",\"-\",BN54)","v":""},"","","",""]
[null,null,null,null,null,null,null,null,null,null,null,null,null,null,null,null,null,null,{"$f":"Cerramiento!C19","v":0},{"$f":"Cerramiento!D19","v":0},{"$f":"Cerramiento!H19","v":""},"","","","","","","","","","","","","","","","","","","","","","",null,null,null,{"$f":"Cerramiento!C46","v":0},{"$f":"Cerramiento!D46","v":0},{"$f":"Cerramiento!H46","v":""},"","","","","","","","","","","","","","","","","",{"$f":"IF(BN54=\"-\",\"-\",BN55)","v":""},"","","",""]
[null,null,null,null,null,null,null,null,null,null,null,null,null,null,null,null,null,null,{"$f":"Cerramiento!C20","v":0},{"$f":"Cerramiento!D20","v":0},{"$f":"Cerramiento!H20","v":""},"","","","","","","","","","","","","","","","","","","","","","",null,null,null,{"$f":"Cerramiento!C47","v":0},{"$f":"Cerramiento!D47","v":0},{"$f":"Cerramiento!H47","v":""},"","","","","","","","","","","","","","","","","",{"$f":"IF(BN55=\"-\",\"-\",BN56)","v":""},"","","",""]
[null,null,null,null,null,null,null,null,null,null,null,null,null,null,null,null,null,null,{"$f":"Cerramiento!C21","v":0},{"$f":"Cerramiento!D21","v":0},{"$f":"Cerramiento!H21","v":""},"","","","","","","","","","","","","","","","","","","","","","",null,null,null,{"$f":"Cerramiento!C48","v":0},{"$f":"Cerramiento!D48","v":0},{"$f":"Cerramiento!H48","v":""},"","","","","","","","","","","","","","","","","",{"$f":"IF(BN56=\"-\",\"-\",BN57)","v":""},"","","",""]
[null,null,null,null,null,null,null,null,null,null,null,null,null,null,null,null,null,null,{"$f":"Cerramiento!C22","v":0},{"$f":"Cerramiento!D22","v":0},{"$f":"Cerramiento!H22","v":""},"","","","","","","","","","","","","","","","","","","","","","",null,null,null,{"$f":"Cerramiento!C49","v":0},{"$f":"Cerramiento!D49","v":0},{"$f":"Cerramiento!H49","v":""},"","","","","","","","","","","","","","","","","",{"$f":"IF(BN57=\"-\",\"-\",BN58)","v":""},"","","",""]
[null,null,null,null,null,null,null,null,null,null,null,null,null,null,null,null,null,null,{"$f":"Cerramiento!C23","v":0},{"$f":"Cerramiento!D23","v":0},{"$f":"Cerramiento!H23","v":""},"","","","","","","","","","","","","","","","","","","","","","",null,null,null,{"$f":"Cerramiento!C50","v":0},{"$f":"Cerramiento!D50","v":0},{"$f":"Cerramiento!H50","v":""},"","","","","","","","","","","","","","","","","",{"$f":"IF(BN58=\"-\",\"-\",BN59)","v":""},"","","",""]
[null,null,null,null,null,null,null,null,null,null,null,null,null,null,null,null,null,null,{"$f":"Cerramiento!C24","v":0},{"$f":"Cerramiento!D24","v":0},{"$f":"Cerramiento!H24","v":""},"","","","","","","","","","","","","","","","","","","","","","",null,null,null,{"$f":"Cerramiento!C51","v":0},{"$f":"Cerramiento!D51","v":0},{"$f":"Cerramiento!H51","v":""},"","","","","","","","","","","","","","","","","",{"$f":"IF(BN59=\"-\",\"-\",BN60)","v":""},"","","",""]
[null,null,null,null,null,null,null,null,null,null,null,null,null,null,null,null,null,null,{"$f":"Cerramiento!C25","v":0},{"$f":"Cerramiento!D25","v":0},{"$f":"Cerramiento!H25","v":""},"","","","","","","","","","","","","","","","","","","","","","",null,null,null,{"$f":"Cerramiento!C52","v":0},{"$f":"Cerramiento!D52","v":0},{"$f":"Cerramiento!H52","v":""},"","","","","","","","","","","","","","","","","",{"$f":"IF(BN60=\"-\",\"-\",BN61)","v":""},"","","",""]
[null,null,null,null,null,null,null,null,null,null,null,null,null,null,null,null,null,null,{"$f":"Cerramiento!C26","v":0},{"$f":"Cerramiento!D26","v":0},{"$f":"Cerramiento!H26","v":""},"","","","","","","","","","",{"$f":"IF(AE61=\"-\",\"-\",AE62)","v":""},"","","","","","","","","","","",null,null,null,{"$f":"Cerramiento!C53","v":0},{"$f":"Cerramiento!D53","v":0},{"$f":"Cerramiento!H53","v":""},"","","","","","","","","","","","","","","","",{"$f":"IF(BM61=\"-\",\"-\",BM62)","v":""},"","","","",""]
[null,null,null,null,null,null,null,null,null,null,null,null,null,null,null,null,null,null,{"$f":"Cerramiento!C27","v":0},{"$f":"Cerramiento!D27","v":0},{"$f":"Cerramiento!H27","v":""},"","","","","","","","","","","","","","","","","",{"$f":"IF(AL62=\"-\",\"-\",AL63)","v":""},"","","","",null,null,null,{"$f":"Cerramiento!C54","v":0},{"$f":"Cerramiento!D54","v":0},{"$f":"Cerramiento!H54","v":""},{"$f":"IF(AW62=\"-\",\"-\",AW63)","v":""},"","","","","","","","","","","","","","","","","","","","",""]
[null,null,null,null,null,null,null,null,null,null,null,null,null,null,null,null,null,null,{"$f":"Cerramiento!C28","v":0},{"$f":"Cerramiento!D28","v":0},{"$f":"Cerramiento!H28","v":""},"","","","","","","","","","","","","","","","","",{"$f":"IF(AL63=\"-\",\"-\",AL64)","v":""},"","","","",null,null,null,{"$f":"Cerramiento!C55","v":0},{"$f":"Cerramiento!D55","v":0},{"$f":"Cerramiento!H55","v":""},"","","","","","","","","","","","","","","","","","","","","",""]
[null,null,null,null,null,null,null,null,null,null,null,null,null,null,null,null,null,null,{"$f":"Cerramiento!C29","v":0},{"$f":"Cerramiento!D29","v":0},{"$f":"Cerramiento!H29","v":""},"","","","","","","","","","","","","","","","","",{"$f":"IF(AL64=\"-\",\"-\",AL65)","v":""},"","","","",null,null,null,{"$f":"Cerramiento!C56","v":0},{"$f":"Cerramiento!D56","v":0},{"$f":"Cerramiento!H56","v":""},"","","","","","","","","","","","","","","","","","","","","",""]
[null,null,null,null,null,null,null,null,null,null,null,null,null,null,null,null,null,null,{"$f":"Cerramiento!C30","v":0},{"$f":"Cerramiento!D30","v":0},{"$f":"Cerramiento!H30","v":""},"","","","","","","","","","","","","","","","","",{"$f":"IF(AL65=\"-\",\"-\",AL66)","v":""},"","","","",null,null,null,{"$f":"Cerramiento!C57","v":0},{"$f":"Cerramiento!D57","v":0},{"$f":"Cerramiento!H57","v":""},"","","","","","","","","","","","","","","","","","","","","",""]
[null,null,null,null,null,null,null,null,null,null,null,null,null,null,null,null,null,null,{"$f":"Cerramiento!C31","v":0},{"$f":"Cerramiento!D31","v":0},{"$f":"Cerramiento!H31","v":""},"","","","","","","","","","","","","","","","","",{"$f":"IF(AL66=\"-\",\"-\",AL67)","v":""},"","","","",null,null,null,{"$f":"Cerramiento!C58","v":0},{"$f":"Cerramiento!D58","v":0},{"$f":"Cerramiento!H58","v":""},"","","","","","","","","","","","","","","","","","","","","",""]
[null,null,null,null,null,null,null,null,null,null,null,null,null,null,null,null,null,null,null,null,null,null,null,null,null,null,null,null,null,null,null,null,null,null,null,null,null,null,null,null,null,"Rse",{"$f":"IF(AP67=\"-\",AQ45,VLOOKUP(Cerramiento!$D$3,$T$4:$W$13,3,FALSE))","v":{"$error":"#N/A"}},null,null,null,null,null,null,null,null,null,null,null,null,null,null,null,null,null,null,null,null,null,null,null,null,null,null,"Rse",{"$f":"IF(BR67=\"-\",BS45,VLOOKUP(Cerramiento!$D$3,$T$4:$W$13,3,FALSE))","v":{"$error":"#N/A"}}]
[]
[]
[null,null,null,null,null,null,null,null,null,null,null,null,null,null,null,null,null,null,"Resto",null,null,null,null,null,null,null,null,null,null,null,null,null,null,null,null,null,null,null,null,null,null,null,null,null,null,null,"Resto"]
[null,null,null,null,null,null,null,null,null,null,null,null,null,null,null,null,null,null,null,null,null,null,null,null,null,null,null,null,null,null,null,null,null,null,null,null,null,null,null,null,null,"Rse",{"$f":"IF(AP73=\"-\",AQ95,VLOOKUP(Cerramiento!$D$3,$T$4:$W$13,3,FALSE))","v":{"$error":"#N/A"}},null,null,null,null,null,null,null,null,null,null,null,null,null,null,null,null,null,null,null,null,null,null,null,null,null,null,"Rse",{"$f":"IF(BR73=\"-\",BS95,VLOOKUP(Cerramiento!$D$3,$T$4:$W$13,3,FALSE))","v":{"$error":"#N/A"}}]
[null,null,null,null,null,null,null,null,null,null,null,null,null,null,null,null,null,null,{"$f":"Cerramiento!C10","v":0},{"$f":"Cerramiento!D10","v":0},{"$f":"Cerramiento!H10","v":""},{"$f":"IF(U74=\"-\",\"-\",U73)","v":""},{"$f":"IF(V74=\"-\",\"-\",V73)","v":""},"","","","","","","","","","","","","","","","","","","",{"$f":"IF(AP73=\"-\",0,AP73)","v":""},null,null,null,{"$f":"Cerramiento!C37","v":0},{"$f":"Cerramiento!D37","v":0},{"$f":"Cerramiento!H37","v":""},{"$f":"IF(AW74=\"-\",\"-\",AW73)","v":""},{"$f":"IF(AX74=\"-\",\"-\",AX73)","v":""},"","","","","","","","","","","","","","","","","","","",{"$f":"IF(BR73=\"-\",0,BR73)","v":""}]
[null,null,null,null,null,null,null,null,null,null,null,null,null,null,null,null,null,null,{"$f":"Cerramiento!C11","v":0},{"$f":"Cerramiento!D11","v":0},{"$f":"Cerramiento!H11","v":""},{"$f":"IF(U75=\"-\",\"-\",U74)","v":""},"","","","","","","","","","","","","","","","","","","","",{"$f":"IF(AP74=\"-\",0,AP74)","v":""},null,null,null,{"$f":"Cerramiento!C38","v":0},{"$f":"Cerramiento!D38","v":0},{"$f":"Cerramiento!H38","v":""},{"$f":"IF(AW75=\"-\",\"-\",AW74)","v":""},"","","","","","","","","","","","","","","","","","","","",{"$f":"IF(BR74=\"-\",0,BR74)","v":""}]
[null,null,null,null,null,null,null,null,null,null,null,null,null,null,null,null,null,null,{"$f":"Cerramiento!C12","v":0},{"$f":"Cerramiento!D12","v":0},{"$f":"Cerramiento!H12","v":""},"","","","","","","","","","","","","","","","","","","","","","",null,null,null,{"$f":"Cerramiento!C39","v":0},{"$f":"Cerramiento!D39","v":0},{"$f":"Cerramiento!H39","v":""},{"$f":"IF(AW76=\"-\",\"-\",AW75)","v":""},"","","","","","","","","","","","","","","","","","","","",""]
[null,null,null,null,null,null,null,null,null,null,null,null,null,null,null,null,null,null,{"$f":"Cerramiento!C13","v":0},{"$f":"Cerramiento!D13","v":0},{"$f":"Cerramiento!H13","v":""},"","","","","","","","","","","","","","","","","","","","","","",null,null,null,{"$f":"Cerramiento!C40","v":0},{"$f":"Cerramiento!D40","v":0},{"$f":"Cerramiento!H40","v":""},{"$f":"IF(AW77=\"-\",\"-\",AW76)","v":""},"","","","","","","","","","","","","","","","","","","","",""]
[null,null,null,null,null,null,null,null,null,null,null,null,null,null,null,null,null,null,{"$f":"Cerramiento!C14","v":0},{"$f":"Cerramiento!D14","v":0},{"$f":"Cerramiento!H14","v":""},"","","","","","","","","","","","","","","","","","","","","","",null,null,null,{"$f":"Cerramiento!C41","v":0},{"$f":"Cerramiento!D41","v":0},{"$f":"Cerramiento!H41","v":""},{"$f":"IF(AW78=\"-\",\"-\",AW77)","v":""},"","","","","","","","","","","","","","","","","","","","",""]
[null,null,null,null,null,null,null,null,null,null,null,null,null,null,null,null,null,null,{"$f":"Cerramiento!C15","v":0},{"$f":"Cerramiento!D15","v":0},{"$f":"Cerramiento!H15","v":""},"","","","","","","","","","","","","","","","","","","","","","",null,null,null,{"$f":"Cerramiento!C42","v":0},{"$f":"Cerramiento!D42","v":0},{"$f":"Cerramiento!H42","v":""},{"$f":"IF(AW79=\"-\",\"-\",AW78)","v":""},"","","","","","","","","","","","","","","","","","","","",""]
[null,null,null,null,null,null,null,null,null,null,null,null,null,null,null,null,null,null,{"$f":"Cerramiento!C16","v":0},{"$f":"Cerramiento!D16","v":0},{"$f":"Cerramiento!H16","v":""},"","","","","","","","","","","","","","","","","","","","","","",null,null,null,{"$f":"Cerramiento!C43","v":0},{"$f":"Cerramiento!D43","v":0},{"$f":"Cerramiento!H43","v":""},{"$f":"IF(AW80=\"-\",\"-\",AW79)","v":""},"","","","","","","","","","","","","","","","","","","","",""]
[null,null,null,null,null,null,null,null,null,null,null,null,null,null,null,null,null,null,{"$f":"Cerramiento!C17","v":0},{"$f":"Cerramiento!D17","v":0},{"$f":"Cerramiento!H17","v":""},"","","","","","","","","","","","","","","","","","","","","","",null,null,null,{"$f":"Cerramiento!C44","v":0},{"$f":"Cerramiento!D44","v":0},{"$f":"Cerramiento!H44","v":""},{"$f":"IF(AW81=\"-\",\"-\",AW80)","v":""},"","","","","","","","","","","","","","","","","","","","",""]
[null,null,null,null,null,null,null,null,null,null,null,null,null,null,null,null,null,null,{"$f":"Cerramiento!C18","v":0},{"$f":"Cerramiento!D18","v":0},{"$f":"Cerramiento!H18","v":""},"","","","","","","","","","","","","","","","","","","","","","",null,null,null,{"$f":"Cerramiento!C45","v":0},{"$f":"Cerramiento!D45","v":0},{"$f":"Cerramiento!H45","v":""},{"$f":"IF(AW82=\"-\",\"-\",AW81)","v":""},"","","","","","","","","","","","","","","","","","","","",""]
[null,null,null,null,null,null,null,null,null,null,null,null,null,null,null,null,null,null,{"$f":"Cerramiento!C19","v":0},{"$f":"Cerramiento!D19","v":0},{"$f":"Cerramiento!H19","v":""},"","","","","","","","","","","","","","","","","","","","","","",null,null,null,{"$f":"Cerramiento!C46","v":0},{"$f":"Cerramiento!D46","v":0},{"$f":"Cerramiento!H46","v":""},{"$f":"IF(AW83=\"-\",\"-\",AW82)","v":""},"","","","","","","","","","","","","","","","","","","","",""]
[null,null,null,null,null,null,null,null,null,null,null,null,null,null,null,null,null,null,{"$f":"Cerramiento!C20","v":0},{"$f":"Cerramiento!D20","v":0},{"$f":"Cerramiento!H20","v":""},"","","","","","","","","","","","","","","","","","","","","","",null,null,null,{"$f":"Cerramiento!C47","v":0},{"$f":"Cerramiento!D47","v":0},{"$f":"Cerramiento!H47","v":""},{"$f":"IF(AW84=\"-\",\"-\",AW83)","v":""},"","","","","","","","","","","","","","","","","","","","",""]
[null,null,null,null,null,null,null,null,null,null,null,null,null,null,null,null,null,null,{"$f":"Cerramiento!C21","v":0},{"$f":"Cerramiento!D21","v":0},{"$f":"Cerramiento!H21","v":""},"","","","","","","","","","","","","","","","","","","","","","",null,null,null,{"$f":"Cerramiento!C48","v":0},{"$f":"Cerramiento!D48","v":0},{"$f":"Cerramiento!H48","v":""},{"$f":"IF(AW85=\"-\",\"-\",AW84)","v":""},"","","","","","","","","","","","","","","","","","","","",""]
[null,null,null,null,null,null,null,null,null,null,null,null,null,null,null,null,null,null,{"$f":"Cerramiento!C22","v":0},{"$f":"Cerramiento!D22","v":0},{"$f":"Cerramiento!H22","v":""},"","","","","","","","","","","","","","","","","","","","","","",null,null,null,{"$f":"Cerramiento!C49","v":0},{"$f":"Cerramiento!D49","v":0},{"$f":"Cerramiento!H49","v":""},{"$f":"IF(AW86=\"-\",\"-\",AW85)","v":""},"","","","","","","","","","","","","","","","","","","","",""]
[null,null,null,null,null,null,null,null,null,null,null,null,null,null,null,null,null,null,{"$f":"Cerramiento!C23","v":0},{"$f":"Cerramiento!D23","v":0},{"$f":"Cerramiento!H23","v":""},"","","","","","","","","","","",{"$f":"IF(AF87=\"-\",\"-\",AF86)","v":""},"","","","","","","","","","",null,null,null,{"$f":"Cerramiento!C50","v":0},{"$f":"Cerramiento!D50","v":0},{"$f":"Cerramiento!H50","v":""},{"$f":"IF(AW87=\"-\",\"-\",AW86)","v":""},"","","","","","","","","","",{"$f":"IF(BH87=\"-\",\"-\",BH86)","v":""},"","","","","","","","","",""]
[null,null,null,null,null,null,null,null,null,null,null,null,null,null,null,null,null,null,{"$f":"Cerramiento!C24","v":0},{"$f":"Cerramiento!D24","v":0},{"$f":"Cerramiento!H24","v":""},"","","","","","","","","","","","","","","","","","","","","","",null,null,null,{"$f":"Cerramiento!C51","v":0},{"$f":"Cerramiento!D51","v":0},{"$f":"Cerramiento!H51","v":""},{"$f":"IF(AW88=\"-\",\"-\",AW87)","v":""},"","","","","","","","","","","","","","","","","","","","",""]
[null,null,null,null,null,null,null,null,null,null,null,null,null,null,null,null,null,null,{"$f":"Cerramiento!C25","v":0},{"$f":"Cerramiento!D25","v":0},{"$f":"Cerramiento!H25","v":""},"","","","","","","","","","","","","","","","","","","","","","",null,null,null,{"$f":"Cerramiento!C52","v":0},{"$f":"Cerramiento!D52","v":0},{"$f":"Cerramiento!H52","v":""},{"$f":"IF(AW89=\"-\",\"-\",AW88)","v":""},"","","","","","","","","","","","","","","","","","","","",""]
[null,null,null,null,null,null,null,null,null,null,null,null,null,null,null,null,null,null,{"$f":"Cerramiento!C26","v":0},{"$f":"Cerramiento!D26","v":0},{"$f":"Cerramiento!H26","v":""},"","","","","","","","","","","","","","","","","","","","","","",null,null,null,{"$f":"Cerramiento!C53","v":0},{"$f":"Cerramiento!D53","v":0},{"$f":"Cerramiento!H53","v":""},{"$f":"IF(AW90=\"-\",\"-\",AW89)","v":""},"","","","","","","","","","","","","","","","","","","","",""]
[null,null,null,null,null,null,null,null,null,null,null,null,null,null,null,null,null,null,{"$f":"Cerramiento!C27","v":0},{"$f":"Cerramiento!D27","v":0},{"$f":"Cerramiento!H27","v":""},"","","","","","","","","","","","","","","","","","","","","","",null,null,null,{"$f":"Cerramiento!C54","v":0},{"$f":"Cerramiento!D54","v":0},{"$f":"Cerramiento!H54","v":""},{"$f":"IF(AW91=\"-\",\"-\",AW90)","v":""},"","","","","","","","","","","","","","","","","","","","",""]
[null,null,null,null,null,null,null,null,null,null,null,null,null,null,null,null,null,null,{"$f":"Cerramiento!C28","v":0},{"$f":"Cerramiento!D28","v":0},{"$f":"Cerramiento!H28","v":""},"","","","","","","","","","","","","","","","","","","","","","",null,null,null,{"$f":"Cerramiento!C55","v":0},{"$f":"Cerramiento!D55","v":0},{"$f":"Cerramiento!H55","v":""},{"$f":"IF(AW92=\"-\",\"-\",AW91)","v":""},"","","","","","","","","","","","","","","","","","","","",""]
[null,null,null,null,null,null,null,null,null,null,null,null,null,null,null,null,null,null,{"$f":"Cerramiento!C29","v":0},{"$f":"Cerramiento!D29","v":0},{"$f":"Cerramiento!H29","v":""},"","","","","","","","","","","","","","","","","","","","","","",null,null,null,{"$f":"Cerramiento!C56","v":0},{"$f":"Cerramiento!D56","v":0},{"$f":"Cerramiento!H56","v":""},{"$f":"IF(AW93=\"-\",\"-\",AW92)","v":""},"","","","","","","","","","","","","","","","","","","","",""]
[null,null,null,null,null,null,null,null,null,null,null,null,null,null,null,null,null,null,{"$f":"Cerramiento!C30","v":0},{"$f":"Cerramiento!D30","v":0},{"$f":"Cerramiento!H30","v":""},"","","","","","","","","","","","","","","","","","","","","","",null,null,null,{"$f":"Cerramiento!C57","v":0},{"$f":"Cerramiento!D57","v":0},{"$f":"Cerramiento!H57","v":""},{"$f":"IF(AW94=\"-\",\"-\",AW93)","v":""},"","","","","","","","","","","","","","","","","","","","",""]
[null,null,null,null,null,null,null,null,null,null,null,null,null,null,null,null,null,null,{"$f":"Cerramiento!C31","v":0},{"$f":"Cerramiento!D31","v":0},{"$f":"Cerramiento!H31","v":""},"","","","","","","","","","","","","","","","","","","","","","",null,null,null,{"$f":"Cerramiento!C58","v":0},{"$f":"Cerramiento!D58","v":0},{"$f":"Cerramiento!H58","v":""},{"$f":"IF(AW95=\"-\",\"-\",AW94)","v":""},"","","","","","","","","","","","","","","","","","","","",""]
[null,null,null,null,null,null,null,null,null,null,null,null,null,null,null,null,null,null,null,null,null,null,null,null,null,null,null,null,null,null,null,null,null,null,null,null,null,null,null,null,null,"Rsi",{"$f":"VLOOKUP(Cerramiento!$D$3,$T$4:$W$13,4,FALSE)","v":{"$error":"#N/A"}},null,null,null,null,null,null,null,null,null,null,null,null,null,null,null,null,null,null,null,null,null,null,null,null,null,null,"Rsi",{"$f":"VLOOKUP(Cerramiento!$D$3,$T$4:$W$13,4,FALSE)","v":{"$error":"#N/A"}}]

{"sheet":"Recop. Datos","index":6,"n_rows":33,"n_cols":13,"rows_kept":33,"cut":false,"hidden":true,"merged":[[24,0,26,1],[29,0,31,1],[4,9,6,10],[9,9,11,10],[14,9,16,10],[19,9,21,10],[24,9,26,10],[29,9,31,10],[19,3,21,4],[19,6,21,7],[29,3,31,4],[29,6,31,7],[19,0,21,1],[24,3,26,4],[24,6,26,7],[14,6,16,7],[0,0,0,4],[4,0,6,1],[9,0,11,1],[14,0,16,1],[0,6,0,13],[4,12,6,13],[2,0,2,1],[2,3,2,4],[2,6,2,7],[2,9,2,10],[4,6,6,7],[9,6,11,7],[14,3,16,4],[4,3,6,4],[9,3,11,4]]}
["Proyecto",null,null,null,null,null,"Alternativa"]
[]
["Suelos",null,null,"Resto",null,null,"Suelos",null,null,"Resto"]
[]
["Resistencia térmica de aislamiento total\n(m²K/W)",null,null,"Resistencia térmica de aislamiento total\n(m²K/W)",null,null,"Resistencia térmica de aislamiento total\n(m²K/W)",null,null,"Resistencia térmica de aislamiento total\n(m²K/W)",null,null,"Mejora de la solución"]
[]
[]
[{"$f":"SUM(Auxiliar!A4:A25)","v":0},null,null,{"$f":"SUM(Auxiliar!I4:I25)","v":0},null,null,{"$f":"SUM(Auxiliar!E4:E25)","v":0},null,null,{"$f":"SUM(Auxiliar!M4:M25)","v":0},null,null,{"$f":"IF((OR(Resultados!G23=\"Faltan datos\",Resultados!Q23=\"Faltan datos\")),\"-\",((Auxiliar!AB20-Auxiliar!AB23)/Auxiliar!AB20))","v":"-"}]
[]
["Resistencia térmica de aislamiento Valero\n(m²K/W)",null,null,"Resistencia térmica de aislamiento Valero\n(m²K/W)",null,null,"Resistencia térmica de aislamiento Valero\n(m²K/W)",null,null,"Resistencia térmica de aislamiento Valero\n(m²K/W)"]
[]
[]
[{"$f":"SUM(Auxiliar!C4:C25)","v":0},null,null,{"$f":"SUM(Auxiliar!K4:K25)","v":0},null,null,{"$f":"SUM(Auxiliar!G4:G25)","v":0},null,null,{"$f":"SUM(Auxiliar!O4:O25)","v":0}]
[]
["Resistencia térmica de la solución\n(m²K/W)",null,null,"Resistencia térmica de la solución\n(m²K/W)",null,null,"Resistencia térmica de la solución\n(m²K/W)",null,null,"Resistencia térmica de la solución\n(m²K/W)"]
[]
[]
[{"$f":"SUM(Auxiliar!AQ46:AQ67)","v":0},null,null,{"$f":"SUM(Auxiliar!AQ73:AQ94)","v":0},null,null,{"$f":"SUM(Auxiliar!BS46:BS67)","v":0},null,null,{"$f":"SUM(Auxiliar!BS73:BS94)","v":0}]
[]
["Importancia del aislamiento en la solución",null,null,"Importancia del aislamiento en la solución",null,null,"Importancia del aislamiento en la solución",null,null,"Importancia del aislamiento en la solución"]
[]
[]
[{"$f":"A8/A18","v":{"$error":"#DIV/0!"}},null,null,{"$f":"D8/D18","v":{"$error":"#DIV/0!"}},null,null,{"$f":"G8/G18","v":{"$error":"#DIV/0!"}},null,null,{"$f":"J8/J18","v":{"$error":"#DIV/0!"}}]
[]
["Importancia del aislamiento Valero en la solución",null,null,"Importancia del aislamiento Valero en la solución",null,null,"Importancia del aislamiento Valero en la solución",null,null,"Importancia del aislamiento Valero en la solución"]
[]
[]
[{"$f":"A13/A18","v":{"$error":"#DIV/0!"}},null,null,{"$f":"D13/D18","v":{"$error":"#DIV/0!"}},null,null,{"$f":"G13/G18","v":{"$error":"#DIV/0!"}},null,null,{"$f":"J13/J18","v":{"$error":"#DIV/0!"}}]
[]
["Importancia del resto de aislamiento en la solución",null,null,"Importancia del resto de aislamiento en la solución",null,null,"Importancia del resto de aislamiento en la solución",null,null,"Importancia del resto de aislamiento en la solución"]
[]
[]
[{"$f":"A23-A28","v":{"$error":"#DIV/0!"}},null,null,{"$f":"D23-D28","v":{"$error":"#DIV/0!"}},null,null,{"$f":"G23-G28","v":{"$error":"#DIV/0!"}},null,null,{"$f":"J23-J28","v":{"$error":"#DIV/0!"}}]

{"sheet":"Tabla3","index":7,"n_rows":43,"n_cols":38,"rows_kept":43,"cut":false,"hidden":true,"merged":[[0,0,1,37],[2,29,2,33],[3,29,3,33],[2,5,2,9],[3,5,3,9],[2,17,2,21],[3,17,3,21]]}
["Tabla 3. TRANSMITANCIA TÉRMICA Us [W/m²K]"]
[]
[null,null,null,null,null,"D = 0.5 m",null,null,null,null,null,null,null,null,null,null,null,"D = 1.0 m",null,null,null,null,null,null,null,null,null,null,null,"D ≥ 1.5 m"]
[null,"Ra [m²\u0097K/ W]",null,null,null,"Ra [m²\u0097K/ W]",null,null,null,null,null,null,null,null,null,null,null,"Ra [m²\u0097K/ W]",null,null,null,null,null,null,null,null,null,null,null,"Ra [m²\u0097K/ W]"]
["B'",0,{"$f":"IF((AND($B$5<$E$40,D5>$E$40)),$E$40,\"0,00\")","v":"0,00"},0.5,{"$f":"IF((AND(D5<$E$40,F5>$E$40)),$E$40,\"0,00\")","v":"0,00"},1,{"$f":"IF((AND(F5<$E$40,H5>$E$40)),$E$40,\"0,00\")","v":"0,00"},1.5,{"$f":"IF((AND(H5<$E$40,J5>$E$40)),$E$40,\"0,00\")","v":"0,00"},2,{"$f":"IF((AND(J5<$E$40,L5>$E$40)),$E$40,\"0,00\")","v":"0,00"},2.5,{"$f":"IF((AND(L5<$E$40,N5>$E$40)),$E$40,\"0,00\")","v":"0,00"},10,{"$f":"IF((AND($B$5<$E$40,P5>$E$40)),$E$40,\"0,00\")","v":"0,00"},0.5,{"$f":"IF((AND(P5<$E$40,R5>$E$40)),$E$40,\"0,00\")","v":"0,00"},1,{"$f":"IF((AND(R5<$E$40,T5>$E$40)),$E$40,\"0,00\")","v":"0,00"},1.5,{"$f":"IF((AND(T5<$E$40,V5>$E$40)),$E$40,\"0,00\")","v":"0,00"},2,{"$f":"IF((AND(V5<$E$40,X5>$E$40)),$E$40,\"0,00\")","v":"0,00"},2.5,{"$f":"IF((AND(X5<$E$40,Z5>$E$40)),$E$40,\"0,00\")","v":"0,00"},10,{"$f":"IF((AND($B$5<$E$40,AB5>$E$40)),$E$40,\"0,00\")","v":"0,00"},0.5,{"$f":"IF((AND(AB5<$E$40,AD5>$E$40)),$E$40,\"0,00\")","v":"0,00"},1,{"$f":"IF((AND(AD5<$E$40,AF5>$E$40)),$E$40,\"0,00\")","v":"0,00"},1.5,{"$f":"IF((AND(AF5<$E$40,AH5>$E$40)),$E$40,\"0,00\")","v":"0,00"},2,{"$f":"IF((AND(AH5<$E$40,AJ5>$E$40)),$E$40,\"0,00\")","v":"0,00"},2.5,{"$f":"IF((AND(AJ5<$E$40,AL5>$E$40)),$E$40,\"0,00\")","v":"0,00"},10]
[0,{"$f":"B10+((($A$6-$A$10)/($A$8-$A$10))*(B8-B10))","v":3.14},{"$f":"B6+(((C$5-B$5)/(D$5-B$5))*(D6-B6))","v":3.14},{"$f":"D10+((($A$6-$A$10)/($A$8-$A$10))*(D8-D10))","v":1.9700000000000002},{"$f":"D6+(((E$5-D$5)/(F$5-D$5))*(F6-D6))","v":2.3800000000000003},{"$f":"F10+((($A$6-$A$10)/($A$8-$A$10))*(F8-F10))","v":1.56},{"$f":"F6+(((G$5-F$5)/(H$5-F$5))*(H6-F6))","v":1.9800000000000004},{"$f":"H10+((($A$6-$A$10)/($A$8-$A$10))*(H8-H10))","v":1.3499999999999999},{"$f":"H6+(((I$5-H$5)/(J$5-H$5))*(J6-H6))","v":1.7399999999999989},{"$f":"J10+((($A$6-$A$10)/($A$8-$A$10))*(J8-J10))","v":1.2200000000000002},{"$f":"J6+(((K$5-J$5)/(L$5-J$5))*(L6-J6))","v":1.5800000000000014},{"$f":"L10+((($A$6-$A$10)/($A$8-$A$10))*(L8-L10))","v":1.1299999999999999},{"$f":"L6+(((M$5-L$5)/(N$5-L$5))*(N6-L6))","v":1.5066666666666664},{"$f":"N10+((($A$6-$A$10)/($A$8-$A$10))*(N8-N10))","v":0},{"$f":"$B6+(((O$5-$B$5)/(P$5-$B$5))*(P6-$B6))","v":3.14},{"$f":"P10+((($A$6-$A$10)/($A$8-$A$10))*(P8-P10))","v":1.6999999999999997},{"$f":"P6+(((Q$5-P$5)/(R$5-P$5))*(R6-P6))","v":2.2699999999999996},{"$f":"R10+((($A$6-$A$10)/($A$8-$A$10))*(R8-R10))","v":1.1299999999999999},1.7699999999999996,{"$f":"T10+((($A$6-$A$10)/($A$8-$A$10))*(T8-T10))","v":0.81},1.44,{"$f":"V10+((($A$6-$A$10)/($A$8-$A$10))*(V8-V10))","v":0.60000000000000009},1.120000000000001,{"$f":"X10+((($A$6-$A$10)/($A$8-$A$10))*(X8-X10))","v":0.46999999999999986},0.62666666666666648,{"$f":"Z10+((($A$6-$A$10)/($A$8-$A$10))*(Z8-Z10))","v":0},{"$f":"$B6+(((AA$5-$B$5)/(AB$5-$B$5))*(AB6-$B6))","v":3.14},0,{"$f":"AB6+(((AC$5-AB$5)/(AD$5-AB$5))*(AD6-AB6))","v":0},0,0,0,0,0,0,0,0,{"$f":"AL10+((($A$6-$A$10)/($A$8-$A$10))*(AL8-AL10))","v":0}]
[{"$f":"IF((AND(A6<$B$40,A8>$B$40)),$B$40,\"0,0\")","v":"0,0"},{"$f":"B8+((($A7-$A8)/($A6-$A8))*(B6-B8))","v":3.14},{"$f":"B7+(((C$5-B$5)/(D$5-B$5))*(D7-B7))","v":3.14},{"$f":"D8+((($A7-$A8)/($A6-$A8))*(D6-D8))","v":1.9700000000000002},2.3800000000000003,{"$f":"F8+((($A7-$A8)/($A6-$A8))*(F6-F8))","v":1.56},1.9800000000000004,{"$f":"H8+((($A7-$A8)/($A6-$A8))*(H6-H8))","v":1.3499999999999999},{"$f":"H7+(((I$5-H$5)/(J$5-H$5))*(J7-H7))","v":1.7399999999999989},{"$f":"J8+((($A7-$A8)/($A6-$A8))*(J6-J8))","v":1.2200000000000002},{"$f":"J7+(((K$5-J$5)/(L$5-J$5))*(L7-J7))","v":1.5800000000000014},{"$f":"L8+((($A7-$A8)/($A6-$A8))*(L6-L8))","v":1.1299999999999999},{"$f":"L7+(((M$5-L$5)/(N$5-L$5))*(N7-L7))","v":1.5066666666666664},{"$f":"N8+((($A7-$A8)/($A6-$A8))*(N6-N8))","v":0},{"$f":"B7+(((O$5-B$5)/(P$5-B$5))*(P7-B7))","v":3.14},{"$f":"P8+((($A7-$A8)/($A6-$A8))*(P6-P8))","v":1.6999999999999997},2.2699999999999996,{"$f":"R8+((($A7-$A8)/($A6-$A8))*(R6-R8))","v":1.1299999999999999},1.7699999999999996,{"$f":"T8+((($A7-$A8)/($A6-$A8))*(T6-T8))","v":0.81},1.44,{"$f":"V8+((($A7-$A8)/($A6-$A8))*(V6-V8))","v":0.60000000000000009},1.120000000000001,{"$f":"X8+((($A7-$A8)/($A6-$A8))*(X6-X8))","v":0.46999999999999986},0.62666666666666648,{"$f":"Z8+((($A7-$A8)/($A6-$A8))*(Z6-Z8))","v":0},{"$f":"$B7+(((AA$5-$B$5)/(AB$5-$B$5))*(AB7-$B7))","v":3.14},{"$f":"AB8+((($A7-$A8)/($A6-$A8))*(AB6-AB8))","v":0},0,{"$f":"AD8+((($A7-$A8)/($A6-$A8))*(AD6-AD8))","v":0},0,{"$f":"AF8+((($A7-$A8)/($A6-$A8))*(AF6-AF8))","v":0},0,{"$f":"AH8+((($A7-$A8)/($A6-$A8))*(AH6-AH8))","v":0},0,{"$f":"AJ8+((($A7-$A8)/($A6-$A8))*(AJ6-AJ8))","v":0},0,{"$f":"AL8+((($A7-$A8)/($A6-$A8))*(AL6-AL8))","v":0}]
[1,2.35,{"$f":"B8+(((C$5-B$5)/(D$5-B$5))*(D8-B8))","v":2.35},1.57,1.84,1.3,1.5800000000000003,1.1599999999999999,{"$f":"H8+(((I$5-H$5)/(J$5-H$5))*(J8-H8))","v":1.4299999999999995},1.07,{"$f":"J8+(((K$5-J$5)/(L$5-J$5))*(L8-J8))","v":1.3100000000000003},1.01,{"$f":"L8+(((M$5-L$5)/(N$5-L$5))*(N8-L8))","v":1.3466666666666667},0,2.35,1.39,1.7699999999999998,1.01,1.43,0.8,1.2200000000000002,0.66,1.0200000000000005,0.56999999999999995,0.7599999999999999,0,2.35,0,0,0,0,0,0,0,0,0,0,0]
[{"$f":"IF((AND(A8<$B$40,A10>$B$40)),$B$40,\"0,0\")","v":"0,0"},{"$f":"B10+((($A9-$A10)/($A8-$A10))*(B8-B10))","v":3.14},{"$f":"B9+(((C$5-B$5)/(D$5-B$5))*(D9-B9))","v":3.14},{"$f":"D10+((($A9-$A10)/($A8-$A10))*(D8-D10))","v":1.9700000000000002},2.3800000000000003,{"$f":"F10+((($A9-$A10)/($A8-$A10))*(F8-F10))","v":1.56},1.9800000000000004,{"$f":"H10+((($A9-$A10)/($A8-$A10))*(H8-H10))","v":1.3499999999999999},{"$f":"H9+(((I$5-H$5)/(J$5-H$5))*(J9-H9))","v":1.7399999999999989},{"$f":"J10+((($A9-$A10)/($A8-$A10))*(J8-J10))","v":1.2200000000000002},{"$f":"J9+(((K$5-J$5)/(L$5-J$5))*(L9-J9))","v":1.5800000000000014},{"$f":"L10+((($A9-$A10)/($A8-$A10))*(L8-L10))","v":1.1299999999999999},{"$f":"L9+(((M$5-L$5)/(N$5-L$5))*(N9-L9))","v":1.5066666666666664},{"$f":"N10+((($A9-$A10)/($A8-$A10))*(N8-N10))","v":0},3.14,{"$f":"P10+((($A9-$A10)/($A8-$A10))*(P8-P10))","v":1.6999999999999997},2.2699999999999996,{"$f":"R10+((($A9-$A10)/($A8-$A10))*(R8-R10))","v":1.1299999999999999},1.7699999999999996,{"$f":"T10+((($A9-$A10)/($A8-$A10))*(T8-T10))","v":0.81},1.44,{"$f":"V10+((($A9-$A10)/($A8-$A10))*(V8-V10))","v":0.60000000000000009},1.120000000000001,{"$f":"X10+((($A9-$A10)/($A8-$A10))*(X8-X10))","v":0.46999999999999986},0.62666666666666648,{"$f":"Z10+((($A9-$A10)/($A8-$A10))*(Z8-Z10))","v":0},3.14,{"$f":"AB10+((($A9-$A10)/($A8-$A10))*(AB8-AB10))","v":-1.04},-1.25,{"$f":"AD10+((($A9-$A10)/($A8-$A10))*(AD8-AD10))","v":-0.83},-1.0899999999999999,{"$f":"AF10+((($A9-$A10)/($A8-$A10))*(AF8-AF10))","v":-0.7},-0.96999999999999986,{"$f":"AH10+((($A9-$A10)/($A8-$A10))*(AH8-AH10))","v":-0.61},-0.84999999999999976,{"$f":"AJ10+((($A9-$A10)/($A8-$A10))*(AJ8-AJ10))","v":-0.55000000000000004},-0.73333333333333339,{"$f":"AL10+((($A9-$A10)/($A8-$A10))*(AL8-AL10))","v":0}]
[2,1.56,{"$f":"B10+(((C$5-B$5)/(D$5-B$5))*(D10-B10))","v":1.56},1.17,1.2999999999999998,1.04,1.1800000000000002,0.97,{"$f":"H10+(((I$5-H$5)/(J$5-H$5))*(J10-H10))","v":1.1199999999999997},0.92,{"$f":"J10+(((K$5-J$5)/(L$5-J$5))*(L10-J10))","v":1.04},0.89,{"$f":"L10+(((M$5-L$5)/(N$5-L$5))*(N10-L10))","v":1.1866666666666665},0,1.56,1.08,1.27,0.89,1.0899999999999999,0.79,1.0000000000000002,0.72,0.91999999999999971,0.67,0.89333333333333331,0,1.56,1.04,1.25,0.83,1.0899999999999999,0.7,0.96999999999999986,0.61,0.84999999999999976,0.55000000000000004,0.73333333333333339,0]
[{"$f":"IF((AND(A10<$B$40,A12>$B$40)),$B$40,\"0,0\")","v":"0,0"},{"$f":"B12+((($A11-$A12)/($A10-$A12))*(B10-B12))","v":2.2800000000000002},{"$f":"B11+(((C$5-B$5)/(D$5-B$5))*(D11-B11))","v":2.2800000000000002},{"$f":"D12+((($A11-$A12)/($A10-$A12))*(D10-D12))","v":1.63},1.8399999999999996,{"$f":"F12+((($A11-$A12)/($A10-$A12))*(F10-F12))","v":1.4200000000000002},1.6400000000000008,{"$f":"H12+((($A11-$A12)/($A10-$A12))*(H10-H12))","v":1.3099999999999998},{"$f":"H11+(((I$5-H$5)/(J$5-H$5))*(J11-H11))","v":1.6399999999999988},{"$f":"J12+((($A11-$A12)/($A10-$A12))*(J10-J12))","v":1.2000000000000002},{"$f":"J11+(((K$5-J$5)/(L$5-J$5))*(L11-J11))","v":1.4000000000000012},{"$f":"L12+((($A11-$A12)/($A10-$A12))*(L10-L12))","v":1.1499999999999999},{"$f":"L11+(((M$5-L$5)/(N$5-L$5))*(N11-L11))","v":1.5333333333333332},{"$f":"N12+((($A11-$A12)/($A10-$A12))*(N10-N12))","v":0},2.2800000000000002,{"$f":"P12+((($A11-$A12)/($A10-$A12))*(P10-P12))","v":1.4800000000000002},1.8100000000000005,{"$f":"R12+((($A11-$A12)/($A10-$A12))*(R10-R12))","v":1.1499999999999999},1.4699999999999993,{"$f":"T12+((($A11-$A12)/($A10-$A12))*(T10-T12))","v":0.99000000000000021},1.3200000000000012,{"$f":"V12+((($A11-$A12)/($A10-$A12))*(V10-V12))","v":0.87999999999999989},1.2399999999999989,{"$f":"X12+((($A11-$A12)/($A10-$A12))*(X10-X12))","v":0.79000000000000015},1.0533333333333335,{"$f":"Z12+((($A11-$A12)/($A10-$A12))*(Z10-Z12))","v":0},2.2800000000000002,{"$f":"AB12+((($A11-$A12)/($A10-$A12))*(AB10-AB12))","v":1.4200000000000002},1.7700000000000005,{"$f":"AD12+((($A11-$A12)/($A10-$A12))*(AD10-AD12))","v":1.0699999999999998},1.5299999999999998,{"$f":"AF12+((($A11-$A12)/($A10-$A12))*(AF10-AF12))","v":0.83999999999999986},1.2899999999999991,{"$f":"AH12+((($A11-$A12)/($A10-$A12))*(AH10-AH12))","v":0.69000000000000006},1.0899999999999999,{"$f":"AJ12+((($A11-$A12)/($A10-$A12))*(AJ10-AJ12))","v":0.59000000000000008},0.78666666666666674,{"$f":"AL12+((($A11-$A12)/($A10-$A12))*(AL10-AL12))","v":0}]
[3,1.2,{"$f":"B12+(((C$5-B$5)/(D$5-B$5))*(D12-B12))","v":1.2},0.94,1.0299999999999998,0.85,0.94999999999999984,0.8,{"$f":"H12+(((I$5-H$5)/(J$5-H$5))*(J12-H12))","v":0.8600000000000001},0.78,{"$f":"J12+(((K$5-J$5)/(L$5-J$5))*(L12-J12))","v":0.8600000000000001},0.76,{"$f":"L12+(((M$5-L$5)/(N$5-L$5))*(N12-L12))","v":1.0133333333333332},0,1.2,0.88,1,0.76,0.90000000000000013,0.69,0.83999999999999975,0.64,0.76000000000000012,0.61,0.81333333333333324,0,1.2,0.85,0.99,0.71,0.86999999999999988,0.63,0.81000000000000016,0.56999999999999995,0.72999999999999965,0.53,0.70666666666666667,0]
[{"$f":"IF((AND(A12<$B$40,A14>$B$40)),$B$40,\"0,0\")","v":"0,0"},{"$f":"B14+((($A13-$A14)/($A12-$A14))*(B12-B14))","v":1.8299999999999998},{"$f":"B13+(((C$5-B$5)/(D$5-B$5))*(D13-B13))","v":1.8299999999999998},{"$f":"D14+((($A13-$A14)/($A12-$A14))*(D12-D14))","v":1.3899999999999997},1.5699999999999994,{"$f":"F14+((($A13-$A14)/($A12-$A14))*(F12-F14))","v":1.21},1.3699999999999992,{"$f":"H14+((($A13-$A14)/($A12-$A14))*(H12-H14))","v":1.1300000000000003},{"$f":"H13+(((I$5-H$5)/(J$5-H$5))*(J13-H13))","v":1.1900000000000017},{"$f":"J14+((($A13-$A14)/($A12-$A14))*(J12-J14))","v":1.1099999999999999},{"$f":"J13+(((K$5-J$5)/(L$5-J$5))*(L13-J13))","v":1.19},{"$f":"L14+((($A13-$A14)/($A12-$A14))*(L12-L14))","v":1.0899999999999999},{"$f":"L13+(((M$5-L$5)/(N$5-L$5))*(N13-L13))","v":1.4533333333333331},{"$f":"N14+((($A13-$A14)/($A12-$A14))*(N12-N14))","v":0},1.8299999999999998,{"$f":"P14+((($A13-$A14)/($A12-$A14))*(P12-P14))","v":1.27},1.4500000000000002,{"$f":"R14+((($A13-$A14)/($A12-$A14))*(R12-R14))","v":1.0899999999999999},1.3499999999999999,{"$f":"T14+((($A13-$A14)/($A12-$A14))*(T12-T14))","v":0.95999999999999985},1.2899999999999987,{"$f":"V14+((($A13-$A14)/($A12-$A14))*(V12-V14))","v":0.8500000000000002},0.97000000000000164,{"$f":"X14+((($A13-$A14)/($A12-$A14))*(X12-X14))","v":0.81999999999999984},1.093333333333333,{"$f":"Z14+((($A13-$A14)/($A12-$A14))*(Z12-Z14))","v":0},1.8299999999999998,{"$f":"AB14+((($A13-$A14)/($A12-$A14))*(AB12-AB14))","v":1.21},1.44,{"$f":"AD14+((($A13-$A14)/($A12-$A14))*(AD12-AD14))","v":0.97999999999999987},1.2599999999999998,{"$f":"AF14+((($A13-$A14)/($A12-$A14))*(AF12-AF14))","v":0.83999999999999986},1.1100000000000001,{"$f":"AH14+((($A13-$A14)/($A12-$A14))*(AH12-AH14))","v":0.74999999999999978},1.0299999999999983,{"$f":"AJ14+((($A13-$A14)/($A12-$A14))*(AJ12-AJ14))","v":0.68000000000000016},0.90666666666666684,{"$f":"AL14+((($A13-$A14)/($A12-$A14))*(AL12-AL14))","v":0}]
[4,0.99,{"$f":"B14+(((C$5-B$5)/(D$5-B$5))*(D14-B14))","v":0.99},0.79,0.85000000000000009,0.73,0.81,0.69,{"$f":"H14+(((I$5-H$5)/(J$5-H$5))*(J14-H14))","v":0.74999999999999967},0.67,{"$f":"J14+(((K$5-J$5)/(L$5-J$5))*(L14-J14))","v":0.75000000000000011},0.65,{"$f":"L14+(((M$5-L$5)/(N$5-L$5))*(N14-L14))","v":0.8666666666666667},0,0.99,0.75,0.85,0.65,0.75000000000000011,0.6,0.69000000000000006,0.56999999999999995,0.68999999999999961,0.54,0.72,0,0.99,0.73,0.84,0.62,0.73999999999999988,0.56000000000000005,0.71000000000000019,0.51,0.63000000000000012,0.48,0.6399999999999999,0]
[{"$f":"IF((AND(A14<$B$40,A16>$B$40)),$B$40,\"0,0\")","v":"0,0"},{"$f":"B16+((($A15-$A16)/($A14-$A16))*(B14-B16))","v":1.55},{"$f":"B15+(((C$5-B$5)/(D$5-B$5))*(D15-B15))","v":1.55},{"$f":"D16+((($A15-$A16)/($A14-$A16))*(D14-D16))","v":1.1900000000000004},1.2900000000000009,{"$f":"F16+((($A15-$A16)/($A14-$A16))*(F14-F16))","v":1.0899999999999999},1.25,{"$f":"H16+((($A15-$A16)/($A14-$A16))*(H14-H16))","v":1.0099999999999998},{"$f":"H15+(((I$5-H$5)/(J$5-H$5))*(J15-H15))","v":1.0699999999999981},{"$f":"J16+((($A15-$A16)/($A14-$A16))*(J14-J16))","v":0.99000000000000032},{"$f":"J15+(((K$5-J$5)/(L$5-J$5))*(L15-J15))","v":1.2300000000000004},{"$f":"L16+((($A15-$A16)/($A14-$A16))*(L14-L16))","v":0.93000000000000027},{"$f":"L15+(((M$5-L$5)/(N$5-L$5))*(N15-L15))","v":1.2400000000000002},{"$f":"N16+((($A15-$A16)/($A14-$A16))*(N14-N16))","v":0},1.55,{"$f":"P16+((($A15-$A16)/($A14-$A16))*(P14-P16))","v":1.1499999999999999},1.3699999999999997,{"$f":"R16+((($A15-$A16)/($A14-$A16))*(R14-R16))","v":0.93000000000000027},1.1100000000000012,{"$f":"T16+((($A15-$A16)/($A14-$A16))*(T14-T16))","v":0.83999999999999975},0.92999999999999983,{"$f":"V16+((($A15-$A16)/($A14-$A16))*(V14-V16))","v":0.80999999999999972},1.0899999999999976,{"$f":"X16+((($A15-$A16)/($A14-$A16))*(X14-X16))","v":0.74000000000000021},0.98666666666666691,{"$f":"Z16+((($A15-$A16)/($A14-$A16))*(Z14-Z16))","v":0},1.55,{"$f":"AB16+((($A15-$A16)/($A14-$A16))*(AB14-AB16))","v":1.0899999999999999},1.2799999999999998,{"$f":"AD16+((($A15-$A16)/($A14-$A16))*(AD14-AD16))","v":0.8999999999999998},1.0999999999999988,{"$f":"AF16+((($A15-$A16)/($A14-$A16))*(AF14-AF16))","v":0.80000000000000027},1.1900000000000006,{"$f":"AH16+((($A15-$A16)/($A14-$A16))*(AH14-AH16))","v":0.67000000000000015},0.79000000000000115,{"$f":"AJ16+((($A15-$A16)/($A14-$A16))*(AJ14-AJ16))","v":0.6399999999999999},0.85333333333333317,{"$f":"AL16+((($A15-$A16)/($A14-$A16))*(AL14-AL16))","v":0}]
[5,0.85,{"$f":"B16+(((C$5-B$5)/(D$5-B$5))*(D16-B16))","v":0.85},0.69,0.73999999999999988,0.64,0.70000000000000007,0.61,{"$f":"H16+(((I$5-H$5)/(J$5-H$5))*(J16-H16))","v":0.67},0.59,{"$f":"J16+(((K$5-J$5)/(L$5-J$5))*(L16-J16))","v":0.63},0.57999999999999996,{"$f":"L16+(((M$5-L$5)/(N$5-L$5))*(N16-L16))","v":0.77333333333333321},0,0.85,0.65,0.72000000000000008,0.57999999999999996,0.65999999999999981,0.54,0.63000000000000012,0.51,0.59000000000000008,0.49,0.65333333333333332,0,0.85,0.64,0.73,0.55000000000000004,0.65000000000000013,0.5,0.59000000000000008,0.47,0.58999999999999986,0.44,0.58666666666666667,0]
[{"$f":"IF((AND(A16<$B$40,A18>$B$40)),$B$40,\"0,0\")","v":"0,0"},{"$f":"B18+((($A17-$A18)/($A16-$A18))*(B16-B18))","v":1.4},{"$f":"B17+(((C$5-B$5)/(D$5-B$5))*(D17-B17))","v":1.4},{"$f":"D18+((($A17-$A18)/($A16-$A18))*(D16-D18))","v":1.0899999999999999},1.1899999999999995,{"$f":"F18+((($A17-$A18)/($A16-$A18))*(F16-F18))","v":0.99000000000000032},1.0500000000000016,{"$f":"H18+((($A17-$A18)/($A16-$A18))*(H16-H18))","v":0.95999999999999974},{"$f":"H17+(((I$5-H$5)/(J$5-H$5))*(J17-H17))","v":1.17},{"$f":"J18+((($A17-$A18)/($A16-$A18))*(J16-J18))","v":0.88999999999999968},{"$f":"J17+(((K$5-J$5)/(L$5-J$5))*(L17-J17))","v":0.92999999999999972},{"$f":"L18+((($A17-$A18)/($A16-$A18))*(L16-L18))","v":0.87999999999999967},{"$f":"L17+(((M$5-L$5)/(N$5-L$5))*(N17-L17))","v":1.1733333333333329},{"$f":"N18+((($A17-$A18)/($A16-$A18))*(N16-N18))","v":0},1.4,{"$f":"P18+((($A17-$A18)/($A16-$A18))*(P16-P18))","v":1.0000000000000004},1.1200000000000012,{"$f":"R18+((($A17-$A18)/($A16-$A18))*(R16-R18))","v":0.87999999999999967},0.95999999999999841,{"$f":"T18+((($A17-$A18)/($A16-$A18))*(T16-T18))","v":0.8400000000000003},1.0800000000000012,{"$f":"V18+((($A17-$A18)/($A16-$A18))*(V16-V18))","v":0.76},0.84000000000000008,{"$f":"X18+((($A17-$A18)/($A16-$A18))*(X16-X18))","v":0.74},0.98666666666666658,{"$f":"Z18+((($A17-$A18)/($A16-$A18))*(Z16-Z18))","v":0},1.4,{"$f":"AB18+((($A17-$A18)/($A16-$A18))*(AB16-AB18))","v":0.99000000000000032},1.1800000000000004,{"$f":"AD18+((($A17-$A18)/($A16-$A18))*(AD16-AD18))","v":0.80000000000000027},0.9000000000000008,{"$f":"AF18+((($A17-$A18)/($A16-$A18))*(AF16-AF18))","v":0.75},0.99000000000000021,{"$f":"AH18+((($A17-$A18)/($A16-$A18))*(AH16-AH18))","v":0.66999999999999993},0.98999999999999932,{"$f":"AJ18+((($A17-$A18)/($A16-$A18))*(AJ16-AJ18))","v":0.59000000000000008},0.78666666666666674,{"$f":"AL18+((($A17-$A18)/($A16-$A18))*(AL16-AL18))","v":0}]
[6,0.74,{"$f":"B18+(((C$5-B$5)/(D$5-B$5))*(D18-B18))","v":0.74},0.61,0.65,0.56999999999999995,0.62999999999999978,0.54,{"$f":"H18+(((I$5-H$5)/(J$5-H$5))*(J18-H18))","v":0.57000000000000006},0.53,{"$f":"J18+(((K$5-J$5)/(L$5-J$5))*(L18-J18))","v":0.57000000000000006},0.52,{"$f":"L18+(((M$5-L$5)/(N$5-L$5))*(N18-L18))","v":0.69333333333333336},0,0.74,0.57999999999999996,0.6399999999999999,0.52,0.60000000000000009,0.48,0.53999999999999981,0.46,0.54,0.44,0.58666666666666667,0,0.74,0.56999999999999995,0.6399999999999999,0.5,0.6,0.45,0.51,0.43,0.51,0.41,0.54666666666666663,0]
[{"$f":"IF((AND(A18<$B$40,A20>$B$40)),$B$40,\"0,0\")","v":"0,0"},{"$f":"B20+((($A19-$A20)/($A18-$A20))*(B18-B20))","v":1.2199999999999998},{"$f":"B19+(((C$5-B$5)/(D$5-B$5))*(D19-B19))","v":1.2199999999999998},{"$f":"D20+((($A19-$A20)/($A18-$A20))*(D18-D20))","v":0.96999999999999964},1.0099999999999998,{"$f":"F20+((($A19-$A20)/($A18-$A20))*(F18-F20))","v":0.9299999999999996},1.1099999999999981,{"$f":"H20+((($A19-$A20)/($A18-$A20))*(H18-H20))","v":0.8400000000000003},{"$f":"H19+(((I$5-H$5)/(J$5-H$5))*(J19-H19))","v":0.87000000000000033},{"$f":"J20+((($A19-$A20)/($A18-$A20))*(J18-J20))","v":0.83000000000000029},{"$f":"J19+(((K$5-J$5)/(L$5-J$5))*(L19-J19))","v":0.87000000000000033},{"$f":"L20+((($A19-$A20)/($A18-$A20))*(L18-L20))","v":0.82000000000000028},{"$f":"L19+(((M$5-L$5)/(N$5-L$5))*(N19-L19))","v":1.0933333333333337},{"$f":"N20+((($A19-$A20)/($A18-$A20))*(N18-N20))","v":0},1.2199999999999998,{"$f":"P20+((($A19-$A20)/($A18-$A20))*(P18-P20))","v":0.87999999999999956},0.93999999999999884,{"$f":"R20+((($A19-$A20)/($A18-$A20))*(R18-R20))","v":0.82000000000000028},1.0200000000000011,{"$f":"T20+((($A19-$A20)/($A18-$A20))*(T18-T20))","v":0.71999999999999986},0.77999999999999892,{"$f":"V20+((($A19-$A20)/($A18-$A20))*(V18-V20))","v":0.70000000000000018},1.0200000000000005,{"$f":"X20+((($A19-$A20)/($A18-$A20))*(X18-X20))","v":0.62000000000000011},0.82666666666666677,{"$f":"Z20+((($A19-$A20)/($A18-$A20))*(Z18-Z20))","v":0},1.2199999999999998,{"$f":"AB20+((($A19-$A20)/($A18-$A20))*(AB18-AB20))","v":0.9299999999999996},1.0599999999999992,{"$f":"AD20+((($A19-$A20)/($A18-$A20))*(AD18-AD20))","v":0.79999999999999993},1.1399999999999997,{"$f":"AF20+((($A19-$A20)/($A18-$A20))*(AF18-AF20))","v":0.63000000000000012},0.51000000000000068,{"$f":"AH20+((($A19-$A20)/($A18-$A20))*(AH18-AH20))","v":0.66999999999999993},0.75,{"$f":"AJ20+((($A19-$A20)/($A18-$A20))*(AJ18-AJ20))","v":0.64999999999999991},0.86666666666666647,{"$f":"AL20+((($A19-$A20)/($A18-$A20))*(AL18-AL20))","v":0}]
[7,0.66,{"$f":"B20+(((C$5-B$5)/(D$5-B$5))*(D20-B20))","v":0.66},0.55000000000000004,0.59000000000000008,0.51,0.55000000000000004,0.49,{"$f":"H20+(((I$5-H$5)/(J$5-H$5))*(J20-H20))","v":0.52},0.48,{"$f":"J20+(((K$5-J$5)/(L$5-J$5))*(L20-J20))","v":0.52},0.47,{"$f":"L20+(((M$5-L$5)/(N$5-L$5))*(N20-L20))","v":0.62666666666666659},0,0.66,0.53,0.59000000000000008,0.47,0.52999999999999992,0.44,0.5,0.42,0.46,0.41,0.54666666666666663,0,0.66,0.51,0.57000000000000006,0.45,0.51,0.42,0.5099999999999999,0.39,0.47000000000000008,0.37,0.49333333333333329,0]
[{"$f":"IF((AND(A20<$B$40,A22>$B$40)),$B$40,\"0,0\")","v":"0,0"},{"$f":"B22+((($A21-$A22)/($A20-$A22))*(B20-B22))","v":1.0800000000000005},{"$f":"B21+(((C$5-B$5)/(D$5-B$5))*(D21-B21))","v":1.0800000000000005},{"$f":"D22+((($A21-$A22)/($A20-$A22))*(D20-D22))","v":0.90000000000000036},1.0100000000000005,{"$f":"F22+((($A21-$A22)/($A20-$A22))*(F20-F22))","v":0.79000000000000026},0.83000000000000118,{"$f":"H22+((($A21-$A22)/($A20-$A22))*(H20-H22))","v":0.7699999999999998},{"$f":"H21+(((I$5-H$5)/(J$5-H$5))*(J21-H21))","v":0.79999999999999982},{"$f":"J22+((($A21-$A22)/($A20-$A22))*(J20-J22))","v":0.75999999999999979},{"$f":"J21+(((K$5-J$5)/(L$5-J$5))*(L21-J21))","v":0.79999999999999982},{"$f":"L22+((($A21-$A22)/($A20-$A22))*(L20-L22))","v":0.74999999999999978},{"$f":"L21+(((M$5-L$5)/(N$5-L$5))*(N21-L21))","v":0.99999999999999967},{"$f":"N22+((($A21-$A22)/($A20-$A22))*(N20-N22))","v":0},1.0800000000000005,{"$f":"P22+((($A21-$A22)/($A20-$A22))*(P20-P22))","v":0.88000000000000034},1.0100000000000009,{"$f":"R22+((($A21-$A22)/($A20-$A22))*(R20-R22))","v":0.74999999999999978},0.94999999999999907,{"$f":"T22+((($A21-$A22)/($A20-$A22))*(T20-T22))","v":0.65000000000000013},0.71000000000000119,{"$f":"V22+((($A21-$A22)/($A20-$A22))*(V20-V22))","v":0.62999999999999978},0.66999999999999982,{"$f":"X22+((($A21-$A22)/($A20-$A22))*(X20-X22))","v":0.61999999999999977},0.82666666666666633,{"$f":"Z22+((($A21-$A22)/($A20-$A22))*(Z20-Z22))","v":0},1.0800000000000005,{"$f":"AB22+((($A21-$A22)/($A20-$A22))*(AB20-AB22))","v":0.79000000000000026},0.92000000000000037,{"$f":"AD22+((($A21-$A22)/($A20-$A22))*(AD20-AD22))","v":0.66000000000000014},0.58000000000000074,{"$f":"AF22+((($A21-$A22)/($A20-$A22))*(AF20-AF22))","v":0.69999999999999984},0.99999999999999878,{"$f":"AH22+((($A21-$A22)/($A20-$A22))*(AH20-AH22))","v":0.6000000000000002},0.96000000000000052,{"$f":"AJ22+((($A21-$A22)/($A20-$A22))*(AJ20-AJ22))","v":0.51000000000000012},0.68000000000000016,{"$f":"AL22+((($A21-$A22)/($A20-$A22))*(AL20-AL22))","v":0}]
[8,0.6,{"$f":"B22+(((C$5-B$5)/(D$5-B$5))*(D22-B22))","v":0.6},0.5,0.53,0.47,0.5099999999999999,0.45,{"$f":"H22+(((I$5-H$5)/(J$5-H$5))*(J22-H22))","v":0.48000000000000004},0.44,{"$f":"J22+(((K$5-J$5)/(L$5-J$5))*(L22-J22))","v":0.48000000000000004},0.43,{"$f":"L22+(((M$5-L$5)/(N$5-L$5))*(N22-L22))","v":0.57333333333333325},0,0.6,0.48,0.53,0.43,0.47000000000000003,0.41,0.46999999999999986,0.39,0.43000000000000005,0.38,0.5066666666666666,0,0.6,0.47,0.52,0.42,0.49999999999999994,0.38,0.44000000000000006,0.36,0.4,0.35,0.46666666666666662,0]
[{"$f":"IF((AND(A22<$B$40,A24>$B$40)),$B$40,\"0,0\")","v":"0,0"},{"$f":"B24+((($A23-$A24)/($A22-$A24))*(B22-B24))","v":0.99999999999999944},{"$f":"B23+(((C$5-B$5)/(D$5-B$5))*(D23-B23))","v":0.99999999999999944},{"$f":"D24+((($A23-$A24)/($A22-$A24))*(D22-D24))","v":0.81999999999999984},0.84999999999999987,{"$f":"F24+((($A23-$A24)/($A22-$A24))*(F22-F24))","v":0.78999999999999981},0.9899999999999991,{"$f":"H24+((($A23-$A24)/($A22-$A24))*(H22-H24))","v":0.69000000000000017},{"$f":"H23+(((I$5-H$5)/(J$5-H$5))*(J23-H23))","v":0.7200000000000002},{"$f":"J24+((($A23-$A24)/($A22-$A24))*(J22-J24))","v":0.68000000000000016},{"$f":"J23+(((K$5-J$5)/(L$5-J$5))*(L23-J23))","v":0.72000000000000197},{"$f":"L24+((($A23-$A24)/($A22-$A24))*(L22-L24))","v":0.66999999999999971},{"$f":"L23+(((M$5-L$5)/(N$5-L$5))*(N23-L23))","v":0.89333333333333287},{"$f":"N24+((($A23-$A24)/($A22-$A24))*(N22-N24))","v":0},0.99999999999999944,{"$f":"P24+((($A23-$A24)/($A22-$A24))*(P22-P24))","v":0.79999999999999982},0.92999999999999994,{"$f":"R24+((($A23-$A24)/($A22-$A24))*(R22-R24))","v":0.66999999999999971},0.70999999999999974,{"$f":"T24+((($A23-$A24)/($A22-$A24))*(T22-T24))","v":0.64999999999999969},0.70999999999999808,{"$f":"V24+((($A23-$A24)/($A22-$A24))*(V22-V24))","v":0.63000000000000023},0.67000000000000026,{"$f":"X24+((($A23-$A24)/($A22-$A24))*(X22-X24))","v":0.62000000000000022},0.82666666666666688,{"$f":"Z24+((($A23-$A24)/($A22-$A24))*(Z22-Z24))","v":0},0.99999999999999944,{"$f":"AB24+((($A23-$A24)/($A22-$A24))*(AB22-AB24))","v":0.78999999999999981},0.91999999999999993,{"$f":"AD24+((($A23-$A24)/($A22-$A24))*(AD22-AD24))","v":0.6599999999999997},0.8999999999999988,{"$f":"AF24+((($A23-$A24)/($A22-$A24))*(AF22-AF24))","v":0.54000000000000015},0.60000000000000153,{"$f":"AH24+((($A23-$A24)/($A22-$A24))*(AH22-AH24))","v":0.51999999999999968},0.55999999999999972,{"$f":"AJ24+((($A23-$A24)/($A22-$A24))*(AJ22-AJ24))","v":0.50999999999999968},0.67999999999999949,{"$f":"AL24+((($A23-$A24)/($A22-$A24))*(AL22-AL24))","v":0}]
[9,0.55000000000000004,{"$f":"B24+(((C$5-B$5)/(D$5-B$5))*(D24-B24))","v":0.55000000000000004},0.46,0.49000000000000005,0.43,0.45,0.42,{"$f":"H24+(((I$5-H$5)/(J$5-H$5))*(J24-H24))","v":0.45},0.41,{"$f":"J24+(((K$5-J$5)/(L$5-J$5))*(L24-J24))","v":0.44999999999999979},0.4,{"$f":"L24+(((M$5-L$5)/(N$5-L$5))*(N24-L24))","v":0.53333333333333333},0,0.55000000000000004,0.44,0.48,0.4,0.44000000000000006,0.38,0.44000000000000006,0.36,0.4,0.35,0.46666666666666662,0,0.55000000000000004,0.43,0.47,0.39,0.45000000000000007,0.36,0.41999999999999987,0.34,0.38000000000000006,0.33,0.44,0]
[{"$f":"IF((AND(A24<$B$40,A26>$B$40)),$B$40,\"0,0\")","v":"0,0"},{"$f":"B26+((($A25-$A26)/($A24-$A26))*(B24-B26))","v":0.91000000000000036},{"$f":"B25+(((C$5-B$5)/(D$5-B$5))*(D25-B25))","v":0.91000000000000036},{"$f":"D26+((($A25-$A26)/($A24-$A26))*(D24-D26))","v":0.7300000000000002},0.76000000000000068,{"$f":"F26+((($A25-$A26)/($A24-$A26))*(F24-F26))","v":0.69999999999999973},0.71999999999999975,{"$f":"H26+((($A25-$A26)/($A24-$A26))*(H24-H26))","v":0.68999999999999972},{"$f":"H25+(((I$5-H$5)/(J$5-H$5))*(J25-H25))","v":0.71999999999999975},{"$f":"J26+((($A25-$A26)/($A24-$A26))*(J24-J26))","v":0.67999999999999972},{"$f":"J25+(((K$5-J$5)/(L$5-J$5))*(L25-J25))","v":0.71999999999999753},{"$f":"L26+((($A25-$A26)/($A24-$A26))*(L24-L26))","v":0.67000000000000026},{"$f":"L25+(((M$5-L$5)/(N$5-L$5))*(N25-L25))","v":0.89333333333333365},{"$f":"N26+((($A25-$A26)/($A24-$A26))*(N24-N26))","v":0},0.91000000000000036,{"$f":"P26+((($A25-$A26)/($A24-$A26))*(P24-P26))","v":0.71000000000000019},0.75000000000000011,{"$f":"R26+((($A25-$A26)/($A24-$A26))*(R24-R26))","v":0.67000000000000026},0.7100000000000003,{"$f":"T26+((($A25-$A26)/($A24-$A26))*(T24-T26))","v":0.65000000000000024},0.9800000000000022,{"$f":"V26+((($A25-$A26)/($A24-$A26))*(V24-V26))","v":0.53999999999999959},0.57999999999999963,{"$f":"X26+((($A25-$A26)/($A24-$A26))*(X24-X26))","v":0.52999999999999958},0.70666666666666611,{"$f":"Z26+((($A25-$A26)/($A24-$A26))*(Z24-Z26))","v":0},0.91000000000000036,{"$f":"AB26+((($A25-$A26)/($A24-$A26))*(AB24-AB26))","v":0.69999999999999973},0.73999999999999921,{"$f":"AD26+((($A25-$A26)/($A24-$A26))*(AD24-AD26))","v":0.66000000000000025},0.90000000000000158,{"$f":"AF26+((($A25-$A26)/($A24-$A26))*(AF24-AF26))","v":0.53999999999999959},0.59999999999999765,{"$f":"AH26+((($A25-$A26)/($A24-$A26))*(AH24-AH26))","v":0.52000000000000024},0.56000000000000028,{"$f":"AJ26+((($A25-$A26)/($A24-$A26))*(AJ24-AJ26))","v":0.51000000000000023},0.68000000000000027,{"$f":"AL26+((($A25-$A26)/($A24-$A26))*(AL24-AL26))","v":0}]
[10,0.51,{"$f":"B26+(((C$5-B$5)/(D$5-B$5))*(D26-B26))","v":0.51},0.43,0.45999999999999996,0.4,0.42000000000000004,0.39,{"$f":"H26+(((I$5-H$5)/(J$5-H$5))*(J26-H26))","v":0.42000000000000004},0.38,{"$f":"J26+(((K$5-J$5)/(L$5-J$5))*(L26-J26))","v":0.42000000000000004},0.37,{"$f":"L26+(((M$5-L$5)/(N$5-L$5))*(N26-L26))","v":0.49333333333333329},0,0.51,0.41,0.44999999999999996,0.37,0.41000000000000003,0.35,0.37999999999999984,0.34,0.38000000000000006,0.33,0.44,0,0.51,0.4,0.44000000000000006,0.36,0.39999999999999991,0.34,0.40000000000000008,0.32,0.36000000000000004,0.31,0.41333333333333333,0]
[{"$f":"IF((AND(A26<$B$40,A28>$B$40)),$B$40,\"0,0\")","v":"0,0"},{"$f":"B28+((($A27-$A28)/($A26-$A28))*(B26-B28))","v":0.8600000000000001},{"$f":"B27+(((C$5-B$5)/(D$5-B$5))*(D27-B27))","v":0.8600000000000001},{"$f":"D28+((($A27-$A28)/($A26-$A28))*(D26-D28))","v":0.67999999999999994},0.75999999999999968,{"$f":"F28+((($A27-$A28)/($A26-$A28))*(F26-F28))","v":0.6000000000000002},0.52000000000000079,{"$f":"H28+((($A27-$A28)/($A26-$A28))*(H26-H28))","v":0.6399999999999999},{"$f":"H27+(((I$5-H$5)/(J$5-H$5))*(J27-H27))","v":0.82000000000000006},{"$f":"J28+((($A27-$A28)/($A26-$A28))*(J26-J28))","v":0.57999999999999985},{"$f":"J27+(((K$5-J$5)/(L$5-J$5))*(L27-J27))","v":0.61999999999999988},{"$f":"L28+((($A27-$A28)/($A26-$A28))*(L26-L28))","v":0.56999999999999984},{"$f":"L27+(((M$5-L$5)/(N$5-L$5))*(N27-L27))","v":0.75999999999999979},{"$f":"N28+((($A27-$A28)/($A26-$A28))*(N26-N28))","v":0},0.8600000000000001,{"$f":"P28+((($A27-$A28)/($A26-$A28))*(P26-P28))","v":0.65999999999999992},0.75,{"$f":"R28+((($A27-$A28)/($A26-$A28))*(R26-R28))","v":0.56999999999999984},0.60999999999999988,{"$f":"T28+((($A27-$A28)/($A26-$A28))*(T26-T28))","v":0.54999999999999982},0.57999999999999852,{"$f":"V28+((($A27-$A28)/($A26-$A28))*(V26-V28))","v":0.54000000000000026},0.58000000000000029,{"$f":"X28+((($A27-$A28)/($A26-$A28))*(X26-X28))","v":0.53000000000000025},0.706666666666667,{"$f":"Z28+((($A27-$A28)/($A26-$A28))*(Z26-Z28))","v":0},0.8600000000000001,{"$f":"AB28+((($A27-$A28)/($A26-$A28))*(AB26-AB28))","v":0.6000000000000002},0.64000000000000057,{"$f":"AD28+((($A27-$A28)/($A26-$A28))*(AD26-AD28))","v":0.55999999999999983},0.59999999999999898,{"$f":"AF28+((($A27-$A28)/($A26-$A28))*(AF26-AF28))","v":0.54000000000000026},0.60000000000000131,{"$f":"AH28+((($A27-$A28)/($A26-$A28))*(AH26-AH28))","v":0.51999999999999991},0.55999999999999994,{"$f":"AJ28+((($A27-$A28)/($A26-$A28))*(AJ26-AJ28))","v":0.5099999999999999},0.67999999999999983,{"$f":"AL28+((($A27-$A28)/($A26-$A28))*(AL26-AL28))","v":0}]
[12,0.44,{"$f":"B28+(((C$5-B$5)/(D$5-B$5))*(D28-B28))","v":0.44},0.38,0.4,0.36,0.39999999999999991,0.34,{"$f":"H28+(((I$5-H$5)/(J$5-H$5))*(J28-H28))","v":0.34},0.34,{"$f":"J28+(((K$5-J$5)/(L$5-J$5))*(L28-J28))","v":0.38000000000000006},0.33,{"$f":"L28+(((M$5-L$5)/(N$5-L$5))*(N28-L28))","v":0.44},0,0.44,0.36,0.38999999999999996,0.33,0.37000000000000005,0.31,0.34,0.3,0.34,0.28999999999999998,0.3866666666666666,0,0.44,0.36,0.39999999999999997,0.32,0.36000000000000004,0.3,0.35999999999999988,0.28000000000000003,0.32000000000000006,0.27,0.36,0]
[{"$f":"IF((AND(A28<$B$40,A30>$B$40)),$B$40,\"0,0\")","v":"0,0"},{"$f":"B30+((($A29-$A30)/($A28-$A30))*(B28-B30))","v":0.74},{"$f":"B29+(((C$5-B$5)/(D$5-B$5))*(D29-B29))","v":0.74},{"$f":"D30+((($A29-$A30)/($A28-$A30))*(D28-D30))","v":0.61999999999999988},0.6399999999999999,{"$f":"F30+((($A29-$A30)/($A28-$A30))*(F28-F30))","v":0.59999999999999987},0.75999999999999912,{"$f":"H30+((($A29-$A30)/($A28-$A30))*(H28-H30))","v":0.52000000000000024},{"$f":"H29+(((I$5-H$5)/(J$5-H$5))*(J29-H29))","v":0.34000000000000008},{"$f":"J30+((($A29-$A30)/($A28-$A30))*(J28-J30))","v":0.58000000000000029},{"$f":"J29+(((K$5-J$5)/(L$5-J$5))*(L29-J29))","v":0.86000000000000054},{"$f":"L30+((($A29-$A30)/($A28-$A30))*(L28-L30))","v":0.51000000000000023},{"$f":"L29+(((M$5-L$5)/(N$5-L$5))*(N29-L29))","v":0.68000000000000027},{"$f":"N30+((($A29-$A30)/($A28-$A30))*(N28-N30))","v":0},0.74,{"$f":"P30+((($A29-$A30)/($A28-$A30))*(P28-P30))","v":0.59999999999999987},0.6899999999999995,{"$f":"R30+((($A29-$A30)/($A28-$A30))*(R28-R30))","v":0.51000000000000023},0.55000000000000104,{"$f":"T30+((($A29-$A30)/($A28-$A30))*(T28-T30))","v":0.48999999999999982},0.5199999999999998,{"$f":"V30+((($A29-$A30)/($A28-$A30))*(V28-V30))","v":0.47999999999999982},0.76,{"$f":"X30+((($A29-$A30)/($A28-$A30))*(X28-X30))","v":0.40999999999999975},0.5466666666666663,{"$f":"Z30+((($A29-$A30)/($A28-$A30))*(Z28-Z30))","v":0},0.74,{"$f":"AB30+((($A29-$A30)/($A28-$A30))*(AB28-AB30))","v":0.59999999999999987},0.69999999999999951,{"$f":"AD30+((($A29-$A30)/($A28-$A30))*(AD28-AD30))","v":0.50000000000000022},0.54000000000000103,{"$f":"AF30+((($A29-$A30)/($A28-$A30))*(AF28-AF30))","v":0.47999999999999982},0.71999999999999886,{"$f":"AH30+((($A29-$A30)/($A28-$A30))*(AH28-AH30))","v":0.40000000000000013},0.44000000000000017,{"$f":"AJ30+((($A29-$A30)/($A28-$A30))*(AJ28-AJ30))","v":0.39000000000000012},0.52000000000000013,{"$f":"AL30+((($A29-$A30)/($A28-$A30))*(AL28-AL30))","v":0}]
[14,0.39,{"$f":"B30+(((C$5-B$5)/(D$5-B$5))*(D30-B30))","v":0.39},0.34,0.36000000000000004,0.32,0.34,0.31,{"$f":"H30+(((I$5-H$5)/(J$5-H$5))*(J30-H30))","v":0.34},0.3,{"$f":"J30+(((K$5-J$5)/(L$5-J$5))*(L30-J30))","v":0.3},0.3,{"$f":"L30+(((M$5-L$5)/(N$5-L$5))*(N30-L30))","v":0.39999999999999997},0,0.39,0.32,0.34,0.3,0.33999999999999991,0.28000000000000003,0.31000000000000005,0.27,0.27,0.27,0.36,0,0.39,0.32,0.35000000000000003,0.28999999999999998,0.3299999999999999,0.27,0.30000000000000004,0.26,0.30000000000000004,0.25,0.33333333333333331,0]
[{"$f":"IF((AND(A30<$B$40,A32>$B$40)),$B$40,\"0,0\")","v":"0,0"},{"$f":"B32+((($A31-$A32)/($A30-$A32))*(B30-B32))","v":0.67000000000000026},{"$f":"B31+(((C$5-B$5)/(D$5-B$5))*(D31-B31))","v":0.67000000000000026},{"$f":"D32+((($A31-$A32)/($A30-$A32))*(D30-D32))","v":0.55000000000000027},0.57000000000000028,{"$f":"F32+((($A31-$A32)/($A30-$A32))*(F30-F32))","v":0.53000000000000025},0.55000000000000115,{"$f":"H32+((($A31-$A32)/($A30-$A32))*(H30-H32))","v":0.5199999999999998},{"$f":"H31+(((I$5-H$5)/(J$5-H$5))*(J31-H31))","v":0.54999999999999982},{"$f":"J32+((($A31-$A32)/($A30-$A32))*(J30-J32))","v":0.50999999999999979},{"$f":"J31+(((K$5-J$5)/(L$5-J$5))*(L31-J31))","v":0.50999999999999979},{"$f":"L32+((($A31-$A32)/($A30-$A32))*(L30-L32))","v":0.50999999999999979},{"$f":"L31+(((M$5-L$5)/(N$5-L$5))*(N31-L31))","v":0.67999999999999972},{"$f":"N32+((($A31-$A32)/($A30-$A32))*(N30-N32))","v":0},0.67000000000000026,{"$f":"P32+((($A31-$A32)/($A30-$A32))*(P30-P32))","v":0.53000000000000025},0.55000000000000071,{"$f":"R32+((($A31-$A32)/($A30-$A32))*(R30-R32))","v":0.50999999999999979},0.68999999999999906,{"$f":"T32+((($A31-$A32)/($A30-$A32))*(T30-T32))","v":0.42000000000000015},0.45000000000000018,{"$f":"V32+((($A31-$A32)/($A30-$A32))*(V30-V32))","v":0.41000000000000014},0.12999999999999989,{"$f":"X32+((($A31-$A32)/($A30-$A32))*(X30-X32))","v":0.4800000000000002},0.64000000000000024,{"$f":"Z32+((($A31-$A32)/($A30-$A32))*(Z30-Z32))","v":0},0.67000000000000026,{"$f":"AB32+((($A31-$A32)/($A30-$A32))*(AB30-AB32))","v":0.53000000000000025},0.56000000000000072,{"$f":"AD32+((($A31-$A32)/($A30-$A32))*(AD30-AD32))","v":0.49999999999999978},0.67999999999999905,{"$f":"AF32+((($A31-$A32)/($A30-$A32))*(AF30-AF32))","v":0.41000000000000014},0.44000000000000017,{"$f":"AH32+((($A31-$A32)/($A30-$A32))*(AH30-AH32))","v":0.40000000000000013},0.44000000000000106,{"$f":"AJ32+((($A31-$A32)/($A30-$A32))*(AJ30-AJ32))","v":0.3899999999999999},0.5199999999999998,{"$f":"AL32+((($A31-$A32)/($A30-$A32))*(AL30-AL32))","v":0}]
[16,0.35,{"$f":"B32+(((C$5-B$5)/(D$5-B$5))*(D32-B32))","v":0.35},0.31,0.33,0.28999999999999998,0.30999999999999989,0.28000000000000003,{"$f":"H32+(((I$5-H$5)/(J$5-H$5))*(J32-H32))","v":0.31000000000000005},0.27,{"$f":"J32+(((K$5-J$5)/(L$5-J$5))*(L32-J32))","v":0.27},0.27,{"$f":"L32+(((M$5-L$5)/(N$5-L$5))*(N32-L32))","v":0.36},0,0.35,0.28999999999999998,0.30999999999999994,0.27,0.29000000000000004,0.26,0.29000000000000004,0.25,0.29000000000000004,0.24,0.31999999999999995,0,0.35,0.28999999999999998,0.31999999999999995,0.26,0.28000000000000003,0.25,0.28000000000000003,0.24,0.27999999999999992,0.23,0.30666666666666664,0]
[{"$f":"IF((AND(A32<$B$40,A34>$B$40)),$B$40,\"0,0\")","v":"0,0"},{"$f":"B34+((($A33-$A34)/($A32-$A34))*(B32-B34))","v":0.58999999999999975},{"$f":"B33+(((C$5-B$5)/(D$5-B$5))*(D33-B33))","v":0.58999999999999975},{"$f":"D34+((($A33-$A34)/($A32-$A34))*(D32-D34))","v":0.54999999999999982},0.64999999999999991,{"$f":"F34+((($A33-$A34)/($A32-$A34))*(F32-F34))","v":0.44999999999999968},0.4699999999999987,{"$f":"H34+((($A33-$A34)/($A32-$A34))*(H32-H34))","v":0.44000000000000017},{"$f":"H33+(((I$5-H$5)/(J$5-H$5))*(J33-H33))","v":0.4700000000000002},{"$f":"J34+((($A33-$A34)/($A32-$A34))*(J32-J34))","v":0.43000000000000016},{"$f":"J33+(((K$5-J$5)/(L$5-J$5))*(L33-J33))","v":0.43000000000000016},{"$f":"L34+((($A33-$A34)/($A32-$A34))*(L32-L34))","v":0.43000000000000016},{"$f":"L33+(((M$5-L$5)/(N$5-L$5))*(N33-L33))","v":0.57333333333333347},{"$f":"N34+((($A33-$A34)/($A32-$A34))*(N32-N34))","v":0},0.58999999999999975,{"$f":"P34+((($A33-$A34)/($A32-$A34))*(P32-P34))","v":0.44999999999999968},0.4699999999999992,{"$f":"R34+((($A33-$A34)/($A32-$A34))*(R32-R34))","v":0.43000000000000016},0.45000000000000018,{"$f":"T34+((($A33-$A34)/($A32-$A34))*(T32-T34))","v":0.42000000000000015},0.45000000000000084,{"$f":"V34+((($A33-$A34)/($A32-$A34))*(V32-V34))","v":0.40999999999999992},0.44999999999999996,{"$f":"X34+((($A33-$A34)/($A32-$A34))*(X32-X34))","v":0.39999999999999991},0.53333333333333321,{"$f":"Z34+((($A33-$A34)/($A32-$A34))*(Z32-Z34))","v":0},0.58999999999999975,{"$f":"AB34+((($A33-$A34)/($A32-$A34))*(AB32-AB34))","v":0.44999999999999968},0.47999999999999921,{"$f":"AD34+((($A33-$A34)/($A32-$A34))*(AD32-AD34))","v":0.42000000000000015},0.44000000000000061,{"$f":"AF34+((($A33-$A34)/($A32-$A34))*(AF32-AF34))","v":0.40999999999999992},0.43999999999999995,{"$f":"AH34+((($A33-$A34)/($A32-$A34))*(AH32-AH34))","v":0.39999999999999991},0.43999999999999906,{"$f":"AJ34+((($A33-$A34)/($A32-$A34))*(AJ32-AJ34))","v":0.39000000000000012},0.52000000000000013,{"$f":"AL34+((($A33-$A34)/($A32-$A34))*(AL32-AL34))","v":0}]
[18,0.32,{"$f":"B34+(((C$5-B$5)/(D$5-B$5))*(D34-B34))","v":0.32},0.28000000000000003,0.29000000000000004,0.27,0.29000000000000004,0.26,{"$f":"H34+(((I$5-H$5)/(J$5-H$5))*(J34-H34))","v":0.29000000000000004},0.25,{"$f":"J34+(((K$5-J$5)/(L$5-J$5))*(L34-J34))","v":0.25},0.25,{"$f":"L34+(((M$5-L$5)/(N$5-L$5))*(N34-L34))","v":0.33333333333333331},0,0.32,0.27,0.29000000000000004,0.25,0.27,0.24,0.26999999999999991,0.23,0.27,0.22,0.29333333333333333,0,0.32,0.27,0.30000000000000004,0.24,0.25999999999999995,0.23,0.26,0.22,0.26,0.21,0.27999999999999997,0]
[{"$f":"IF((AND(A34<$B$40,A36>$B$40)),$B$40,\"0,0\")","v":"0,0"},{"$f":"B36+((($A35-$A36)/($A34-$A36))*(B34-B36))","v":0.50000000000000022},{"$f":"B35+(((C$5-B$5)/(D$5-B$5))*(D35-B35))","v":0.50000000000000022},{"$f":"D36+((($A35-$A36)/($A34-$A36))*(D34-D36))","v":0.46000000000000019},0.4700000000000002,{"$f":"F36+((($A35-$A36)/($A34-$A36))*(F34-F36))","v":0.45000000000000018},0.4700000000000002,{"$f":"H36+((($A35-$A36)/($A34-$A36))*(H34-H36))","v":0.44000000000000017},{"$f":"H35+(((I$5-H$5)/(J$5-H$5))*(J35-H35))","v":0.47000000000000086},{"$f":"J36+((($A35-$A36)/($A34-$A36))*(J34-J36))","v":0.42999999999999994},{"$f":"J35+(((K$5-J$5)/(L$5-J$5))*(L35-J35))","v":0.42999999999999994},{"$f":"L36+((($A35-$A36)/($A34-$A36))*(L34-L36))","v":0.42999999999999994},{"$f":"L35+(((M$5-L$5)/(N$5-L$5))*(N35-L35))","v":0.57333333333333325},{"$f":"N36+((($A35-$A36)/($A34-$A36))*(N34-N36))","v":0},0.50000000000000022,{"$f":"P36+((($A35-$A36)/($A34-$A36))*(P34-P36))","v":0.45000000000000018},0.47000000000000042,{"$f":"R36+((($A35-$A36)/($A34-$A36))*(R34-R36))","v":0.42999999999999994},0.44999999999999996,{"$f":"T36+((($A35-$A36)/($A34-$A36))*(T34-T36))","v":0.41999999999999993},0.44999999999999929,{"$f":"V36+((($A35-$A36)/($A34-$A36))*(V34-V36))","v":0.41000000000000014},0.8100000000000005,{"$f":"X36+((($A35-$A36)/($A34-$A36))*(X34-X36))","v":0.31000000000000005},0.41333333333333339,{"$f":"Z36+((($A35-$A36)/($A34-$A36))*(Z34-Z36))","v":0},0.50000000000000022,{"$f":"AB36+((($A35-$A36)/($A34-$A36))*(AB34-AB36))","v":0.45000000000000018},0.48000000000000043,{"$f":"AD36+((($A35-$A36)/($A34-$A36))*(AD34-AD36))","v":0.41999999999999993},0.4399999999999995,{"$f":"AF36+((($A35-$A36)/($A34-$A36))*(AF34-AF36))","v":0.41000000000000014},0.44000000000000083,{"$f":"AH36+((($A35-$A36)/($A34-$A36))*(AH34-AH36))","v":0.39999999999999991},0.80000000000000027,{"$f":"AJ36+((($A35-$A36)/($A34-$A36))*(AJ34-AJ36))","v":0.29999999999999982},0.39999999999999974,{"$f":"AL36+((($A35-$A36)/($A34-$A36))*(AL34-AL36))","v":0}]
[20,0.3,{"$f":"B36+(((C$5-B$5)/(D$5-B$5))*(D36-B36))","v":0.3},0.26,0.27,0.25,0.27,0.24,{"$f":"H36+(((I$5-H$5)/(J$5-H$5))*(J36-H36))","v":0.26999999999999991},0.23,{"$f":"J36+(((K$5-J$5)/(L$5-J$5))*(L36-J36))","v":0.23},0.23,{"$f":"L36+(((M$5-L$5)/(N$5-L$5))*(N36-L36))","v":0.30666666666666664},0,0.3,0.25,0.27,0.23,0.25,0.22,0.25,0.21,0.21,0.21,0.27999999999999997,0,0.3,0.25,0.28000000000000003,0.22,0.24000000000000002,0.21,0.23999999999999994,0.2,0.2,0.2,0.26666666666666666,0]
[{"$f":"IF((AND(A36<$B$40,A38>$B$40)),$B$40,\"0,0\")","v":"0,0"},{"$f":"B38+((($A37-$A38)/($A36-$A38))*(B36-B38))","v":0.3},{"$f":"B37+(((C$5-B$5)/(D$5-B$5))*(D37-B37))","v":0.3},{"$f":"D38+((($A37-$A38)/($A36-$A38))*(D36-D38))","v":0.26},0.27,{"$f":"F38+((($A37-$A38)/($A36-$A38))*(F36-F38))","v":0.25},0.27,{"$f":"H38+((($A37-$A38)/($A36-$A38))*(H36-H38))","v":0.24},{"$f":"H37+(((I$5-H$5)/(J$5-H$5))*(J37-H37))","v":0.26999999999999991},{"$f":"J38+((($A37-$A38)/($A36-$A38))*(J36-J38))","v":0.23},{"$f":"J37+(((K$5-J$5)/(L$5-J$5))*(L37-J37))","v":0.23},{"$f":"L38+((($A37-$A38)/($A36-$A38))*(L36-L38))","v":0.23},{"$f":"L37+(((M$5-L$5)/(N$5-L$5))*(N37-L37))","v":0.30666666666666664},{"$f":"N38+((($A37-$A38)/($A36-$A38))*(N36-N38))","v":0},0.3,{"$f":"P38+((($A37-$A38)/($A36-$A38))*(P36-P38))","v":0.25},0.27,{"$f":"R38+((($A37-$A38)/($A36-$A38))*(R36-R38))","v":0.23},0.25,{"$f":"T38+((($A37-$A38)/($A36-$A38))*(T36-T38))","v":0.22},0.25,{"$f":"V38+((($A37-$A38)/($A36-$A38))*(V36-V38))","v":0.21},0.21,{"$f":"X38+((($A37-$A38)/($A36-$A38))*(X36-X38))","v":0.21},0.27999999999999997,{"$f":"Z38+((($A37-$A38)/($A36-$A38))*(Z36-Z38))","v":0},0.3,{"$f":"AB38+((($A37-$A38)/($A36-$A38))*(AB36-AB38))","v":0.25},0.28000000000000003,{"$f":"AD38+((($A37-$A38)/($A36-$A38))*(AD36-AD38))","v":0.22},0.24000000000000002,{"$f":"AF38+((($A37-$A38)/($A36-$A38))*(AF36-AF38))","v":0.21},0.23999999999999994,{"$f":"AH38+((($A37-$A38)/($A36-$A38))*(AH36-AH38))","v":0.2},0.2,{"$f":"AJ38+((($A37-$A38)/($A36-$A38))*(AJ36-AJ38))","v":0.2},0.26666666666666666,{"$f":"AL38+((($A37-$A38)/($A36-$A38))*(AL36-AL38))","v":0}]
[1000,{"$f":"B36","v":0.3},0.3,{"$f":"D36","v":0.26},0.27,0.25,0.27,0.24,0.26999999999999991,0.23,0.23,0.23,0.30666666666666664,0,0.3,0.25,0.27,0.23,0.25,0.22,0.25,0.21,0.21,0.21,0.27999999999999997,0,0.3,0.25,0.28000000000000003,0.22,0.24000000000000002,0.21,0.23999999999999994,0.2,0.2,0.2,0.26666666666666666,0]
[]
["B'",{"$f":"IF(Cerramiento!G3=\"ESTIMADOS\",Auxiliar!AF31,'Datos necesarios'!H24)","v":""},null,"Ra",{"$f":"'Recop. Datos'!A8","v":0},1,"Us (0,0)",{"$f":"IFERROR((INDEX(B6:B38,MATCH(B40,A6:A38,0))),0)","v":0}]
[null,null,null,null,null,2,"Us (0,5)",{"$f":"IFERROR((INDEX(C6:N38,MATCH(B40,A6:A38,0),MATCH(E40,C5:N5,0))),0)","v":0}]
[null,null,null,null,null,3,"Us (1,0)",{"$f":"IFERROR((INDEX(O6:Z38,MATCH(B40,A6:A38,0),MATCH(E40,O5:Z5,0))),0)","v":0}]
[null,null,null,null,null,4,"Us (1,5)",{"$f":"IFERROR((INDEX(AA6:AL38,MATCH(B40,A6:A38,0),MATCH(E40,AA5:AL5,0))),0)","v":0}]

{"sheet":"Tabla3V","index":8,"n_rows":43,"n_cols":38,"rows_kept":43,"cut":false,"hidden":true,"merged":[[0,0,1,37],[2,5,2,9],[2,17,2,21],[2,29,2,33],[3,5,3,9],[3,17,3,21],[3,29,3,33]]}
["Tabla 3. TRANSMITANCIA TÉRMICA Us [W/m²K]"]
[]
[null,null,null,null,null,"D = 0.5 m",null,null,null,null,null,null,null,null,null,null,null,"D = 1.0 m",null,null,null,null,null,null,null,null,null,null,null,"D ≥ 1.5 m"]
[null,"Ra [m²\u0097K/ W]",null,null,null,"Ra [m²\u0097K/ W]",null,null,null,null,null,null,null,null,null,null,null,"Ra [m²\u0097K/ W]",null,null,null,null,null,null,null,null,null,null,null,"Ra [m²\u0097K/ W]"]
["B'",0,{"$f":"IF((AND($B$5<$E$40,D5>$E$40)),$E$40,\"0,00\")","v":"0,00"},0.5,{"$f":"IF((AND(D5<$E$40,F5>$E$40)),$E$40,\"0,00\")","v":"0,00"},1,{"$f":"IF((AND(F5<$E$40,H5>$E$40)),$E$40,\"0,00\")","v":"0,00"},1.5,{"$f":"IF((AND(H5<$E$40,J5>$E$40)),$E$40,\"0,00\")","v":"0,00"},2,{"$f":"IF((AND(J5<$E$40,L5>$E$40)),$E$40,\"0,00\")","v":"0,00"},2.5,{"$f":"IF((AND(L5<$E$40,N5>$E$40)),$E$40,\"0,00\")","v":"0,00"},10,{"$f":"IF((AND($B$5<$E$40,P5>$E$40)),$E$40,\"0,00\")","v":"0,00"},0.5,{"$f":"IF((AND(P5<$E$40,R5>$E$40)),$E$40,\"0,00\")","v":"0,00"},1,{"$f":"IF((AND(R5<$E$40,T5>$E$40)),$E$40,\"0,00\")","v":"0,00"},1.5,{"$f":"IF((AND(T5<$E$40,V5>$E$40)),$E$40,\"0,00\")","v":"0,00"},2,{"$f":"IF((AND(V5<$E$40,X5>$E$40)),$E$40,\"0,00\")","v":"0,00"},2.5,{"$f":"IF((AND(X5<$E$40,Z5>$E$40)),$E$40,\"0,00\")","v":"0,00"},10,{"$f":"IF((AND($B$5<$E$40,AB5>$E$40)),$E$40,\"0,00\")","v":"0,00"},0.5,{"$f":"IF((AND(AB5<$E$40,AD5>$E$40)),$E$40,\"0,00\")","v":"0,00"},1,{"$f":"IF((AND(AD5<$E$40,AF5>$E$40)),$E$40,\"0,00\")","v":"0,00"},1.5,{"$f":"IF((AND(AF5<$E$40,AH5>$E$40)),$E$40,\"0,00\")","v":"0,00"},2,{"$f":"IF((AND(AH5<$E$40,AJ5>$E$40)),$E$40,\"0,00\")","v":"0,00"},2.5,{"$f":"IF((AND(AJ5<$E$40,AL5>$E$40)),$E$40,\"0,00\")","v":"0,00"},10]
[0,{"$f":"B10+((($A$6-$A$10)/($A$8-$A$10))*(B8-B10))","v":3.14},{"$f":"B6+(((C$5-B$5)/(D$5-B$5))*(D6-B6))","v":3.14},{"$f":"D10+((($A$6-$A$10)/($A$8-$A$10))*(D8-D10))","v":1.9700000000000002},{"$f":"D6+(((E$5-D$5)/(F$5-D$5))*(F6-D6))","v":2.3800000000000003},{"$f":"F10+((($A$6-$A$10)/($A$8-$A$10))*(F8-F10))","v":1.56},{"$f":"F6+(((G$5-F$5)/(H$5-F$5))*(H6-F6))","v":1.9800000000000004},{"$f":"H10+((($A$6-$A$10)/($A$8-$A$10))*(H8-H10))","v":1.3499999999999999},{"$f":"H6+(((I$5-H$5)/(J$5-H$5))*(J6-H6))","v":1.7399999999999989},{"$f":"J10+((($A$6-$A$10)/($A$8-$A$10))*(J8-J10))","v":1.2200000000000002},{"$f":"J6+(((K$5-J$5)/(L$5-J$5))*(L6-J6))","v":1.5800000000000014},{"$f":"L10+((($A$6-$A$10)/($A$8-$A$10))*(L8-L10))","v":1.1299999999999999},{"$f":"L6+(((M$5-L$5)/(N$5-L$5))*(N6-L6))","v":1.5066666666666664},{"$f":"N10+((($A$6-$A$10)/($A$8-$A$10))*(N8-N10))","v":0},{"$f":"$B6+(((O$5-$B$5)/(P$5-$B$5))*(P6-$B6))","v":3.14},{"$f":"P10+((($A$6-$A$10)/($A$8-$A$10))*(P8-P10))","v":1.6999999999999997},{"$f":"P6+(((Q$5-P$5)/(R$5-P$5))*(R6-P6))","v":2.2699999999999996},{"$f":"R10+((($A$6-$A$10)/($A$8-$A$10))*(R8-R10))","v":1.1299999999999999},1.7699999999999996,{"$f":"T10+((($A$6-$A$10)/($A$8-$A$10))*(T8-T10))","v":0.81},1.44,{"$f":"V10+((($A$6-$A$10)/($A$8-$A$10))*(V8-V10))","v":0.60000000000000009},1.120000000000001,{"$f":"X10+((($A$6-$A$10)/($A$8-$A$10))*(X8-X10))","v":0.46999999999999986},0.62666666666666648,{"$f":"Z10+((($A$6-$A$10)/($A$8-$A$10))*(Z8-Z10))","v":0},{"$f":"$B6+(((AA$5-$B$5)/(AB$5-$B$5))*(AB6-$B6))","v":3.14},0,{"$f":"AB6+(((AC$5-AB$5)/(AD$5-AB$5))*(AD6-AB6))","v":0},0,0,0,0,0,0,0,0,{"$f":"AL10+((($A$6-$A$10)/($A$8-$A$10))*(AL8-AL10))","v":0}]
[{"$f":"IF((AND(A6<$B$40,A8>$B$40)),$B$40,\"0,0\")","v":"0,0"},{"$f":"B8+((($A7-$A8)/($A6-$A8))*(B6-B8))","v":3.14},3.14,{"$f":"D8+((($A7-$A8)/($A6-$A8))*(D6-D8))","v":1.9700000000000002},2.3800000000000003,{"$f":"F8+((($A7-$A8)/($A6-$A8))*(F6-F8))","v":1.56},1.9800000000000004,{"$f":"H8+((($A7-$A8)/($A6-$A8))*(H6-H8))","v":1.3499999999999999},1.7399999999999989,{"$f":"J8+((($A7-$A8)/($A6-$A8))*(J6-J8))","v":1.2200000000000002},1.5800000000000014,{"$f":"L8+((($A7-$A8)/($A6-$A8))*(L6-L8))","v":1.1299999999999999},1.5066666666666664,{"$f":"N8+((($A7-$A8)/($A6-$A8))*(N6-N8))","v":0},{"$f":"B7+(((O$5-B$5)/(P$5-B$5))*(P7-B7))","v":3.14},{"$f":"P8+((($A7-$A8)/($A6-$A8))*(P6-P8))","v":1.6999999999999997},2.2699999999999996,{"$f":"R8+((($A7-$A8)/($A6-$A8))*(R6-R8))","v":1.1299999999999999},1.7699999999999996,{"$f":"T8+((($A7-$A8)/($A6-$A8))*(T6-T8))","v":0.81},1.44,{"$f":"V8+((($A7-$A8)/($A6-$A8))*(V6-V8))","v":0.60000000000000009},1.120000000000001,{"$f":"X8+((($A7-$A8)/($A6-$A8))*(X6-X8))","v":0.46999999999999986},0.62666666666666648,{"$f":"Z8+((($A7-$A8)/($A6-$A8))*(Z6-Z8))","v":0},{"$f":"$B7+(((AA$5-$B$5)/(AB$5-$B$5))*(AB7-$B7))","v":3.14},{"$f":"AB8+((($A7-$A8)/($A6-$A8))*(AB6-AB8))","v":0},0,{"$f":"AD8+((($A7-$A8)/($A6-$A8))*(AD6-AD8))","v":0},0,{"$f":"AF8+((($A7-$A8)/($A6-$A8))*(AF6-AF8))","v":0},0,{"$f":"AH8+((($A7-$A8)/($A6-$A8))*(AH6-AH8))","v":0},0,{"$f":"AJ8+((($A7-$A8)/($A6-$A8))*(AJ6-AJ8))","v":0},0,{"$f":"AL8+((($A7-$A8)/($A6-$A8))*(AL6-AL8))","v":0}]
[1,2.35,2.35,1.57,1.84,1.3,1.5800000000000003,1.1599999999999999,1.4299999999999995,1.07,1.3100000000000003,1.01,1.3466666666666667,0,2.35,1.39,1.7699999999999998,1.01,1.43,0.8,1.2200000000000002,0.66,1.0200000000000005,0.56999999999999995,0.7599999999999999,0,2.35,0,0,0,0,0,0,0,0,0,0,0]
[{"$f":"IF((AND(A8<$B$40,A10>$B$40)),$B$40,\"0,0\")","v":"0,0"},{"$f":"B10+((($A9-$A10)/($A8-$A10))*(B8-B10))","v":3.14},3.14,{"$f":"D10+((($A9-$A10)/($A8-$A10))*(D8-D10))","v":1.9700000000000002},2.3800000000000003,{"$f":"F10+((($A9-$A10)/($A8-$A10))*(F8-F10))","v":1.56},1.9800000000000004,{"$f":"H10+((($A9-$A10)/($A8-$A10))*(H8-H10))","v":1.3499999999999999},1.7399999999999989,{"$f":"J10+((($A9-$A10)/($A8-$A10))*(J8-J10))","v":1.2200000000000002},1.5800000000000014,{"$f":"L10+((($A9-$A10)/($A8-$A10))*(L8-L10))","v":1.1299999999999999},1.5066666666666664,{"$f":"N10+((($A9-$A10)/($A8-$A10))*(N8-N10))","v":0},3.14,{"$f":"P10+((($A9-$A10)/($A8-$A10))*(P8-P10))","v":1.6999999999999997},2.2699999999999996,{"$f":"R10+((($A9-$A10)/($A8-$A10))*(R8-R10))","v":1.1299999999999999},1.7699999999999996,{"$f":"T10+((($A9-$A10)/($A8-$A10))*(T8-T10))","v":0.81},1.44,{"$f":"V10+((($A9-$A10)/($A8-$A10))*(V8-V10))","v":0.60000000000000009},1.120000000000001,{"$f":"X10+((($A9-$A10)/($A8-$A10))*(X8-X10))","v":0.46999999999999986},0.62666666666666648,{"$f":"Z10+((($A9-$A10)/($A8-$A10))*(Z8-Z10))","v":0},3.14,{"$f":"AB10+((($A9-$A10)/($A8-$A10))*(AB8-AB10))","v":-1.04},-1.25,{"$f":"AD10+((($A9-$A10)/($A8-$A10))*(AD8-AD10))","v":-0.83},-1.0899999999999999,{"$f":"AF10+((($A9-$A10)/($A8-$A10))*(AF8-AF10))","v":-0.7},-0.96999999999999986,{"$f":"AH10+((($A9-$A10)/($A8-$A10))*(AH8-AH10))","v":-0.61},-0.84999999999999976,{"$f":"AJ10+((($A9-$A10)/($A8-$A10))*(AJ8-AJ10))","v":-0.55000000000000004},-0.73333333333333339,{"$f":"AL10+((($A9-$A10)/($A8-$A10))*(AL8-AL10))","v":0}]
[2,1.56,1.56,1.17,1.2999999999999998,1.04,1.1800000000000002,0.97,1.1199999999999997,0.92,1.04,0.89,1.1866666666666665,0,1.56,1.08,1.27,0.89,1.0899999999999999,0.79,1.0000000000000002,0.72,0.91999999999999971,0.67,0.89333333333333331,0,1.56,1.04,1.25,0.83,1.0899999999999999,0.7,0.96999999999999986,0.61,0.84999999999999976,0.55000000000000004,0.73333333333333339,0]
[{"$f":"IF((AND(A10<$B$40,A12>$B$40)),$B$40,\"0,0\")","v":"0,0"},{"$f":"B12+((($A11-$A12)/($A10-$A12))*(B10-B12))","v":2.2800000000000002},2.2800000000000002,{"$f":"D12+((($A11-$A12)/($A10-$A12))*(D10-D12))","v":1.63},1.8399999999999996,{"$f":"F12+((($A11-$A12)/($A10-$A12))*(F10-F12))","v":1.4200000000000002},1.6400000000000008,{"$f":"H12+((($A11-$A12)/($A10-$A12))*(H10-H12))","v":1.3099999999999998},1.6399999999999988,{"$f":"J12+((($A11-$A12)/($A10-$A12))*(J10-J12))","v":1.2000000000000002},1.4000000000000012,{"$f":"L12+((($A11-$A12)/($A10-$A12))*(L10-L12))","v":1.1499999999999999},1.5333333333333332,{"$f":"N12+((($A11-$A12)/($A10-$A12))*(N10-N12))","v":0},2.2800000000000002,{"$f":"P12+((($A11-$A12)/($A10-$A12))*(P10-P12))","v":1.4800000000000002},1.8100000000000005,{"$f":"R12+((($A11-$A12)/($A10-$A12))*(R10-R12))","v":1.1499999999999999},1.4699999999999993,{"$f":"T12+((($A11-$A12)/($A10-$A12))*(T10-T12))","v":0.99000000000000021},1.3200000000000012,{"$f":"V12+((($A11-$A12)/($A10-$A12))*(V10-V12))","v":0.87999999999999989},1.2399999999999989,{"$f":"X12+((($A11-$A12)/($A10-$A12))*(X10-X12))","v":0.79000000000000015},1.0533333333333335,{"$f":"Z12+((($A11-$A12)/($A10-$A12))*(Z10-Z12))","v":0},2.2800000000000002,{"$f":"AB12+((($A11-$A12)/($A10-$A12))*(AB10-AB12))","v":1.4200000000000002},1.7700000000000005,{"$f":"AD12+((($A11-$A12)/($A10-$A12))*(AD10-AD12))","v":1.0699999999999998},1.5299999999999998,{"$f":"AF12+((($A11-$A12)/($A10-$A12))*(AF10-AF12))","v":0.83999999999999986},1.2899999999999991,{"$f":"AH12+((($A11-$A12)/($A10-$A12))*(AH10-AH12))","v":0.69000000000000006},1.0899999999999999,{"$f":"AJ12+((($A11-$A12)/($A10-$A12))*(AJ10-AJ12))","v":0.59000000000000008},0.78666666666666674,{"$f":"AL12+((($A11-$A12)/($A10-$A12))*(AL10-AL12))","v":0}]
[3,1.2,1.2,0.94,1.0299999999999998,0.85,0.94999999999999984,0.8,0.8600000000000001,0.78,0.8600000000000001,0.76,1.0133333333333332,0,1.2,0.88,1,0.76,0.90000000000000013,0.69,0.83999999999999975,0.64,0.76000000000000012,0.61,0.81333333333333324,0,1.2,0.85,0.99,0.71,0.86999999999999988,0.63,0.81000000000000016,0.56999999999999995,0.72999999999999965,0.53,0.70666666666666667,0]
[{"$f":"IF((AND(A12<$B$40,A14>$B$40)),$B$40,\"0,0\")","v":"0,0"},{"$f":"B14+((($A13-$A14)/($A12-$A14))*(B12-B14))","v":1.8299999999999998},1.8299999999999998,{"$f":"D14+((($A13-$A14)/($A12-$A14))*(D12-D14))","v":1.3899999999999997},1.5699999999999994,{"$f":"F14+((($A13-$A14)/($A12-$A14))*(F12-F14))","v":1.21},1.3699999999999992,{"$f":"H14+((($A13-$A14)/($A12-$A14))*(H12-H14))","v":1.1300000000000003},1.1900000000000017,{"$f":"J14+((($A13-$A14)/($A12-$A14))*(J12-J14))","v":1.1099999999999999},1.19,{"$f":"L14+((($A13-$A14)/($A12-$A14))*(L12-L14))","v":1.0899999999999999},1.4533333333333331,{"$f":"N14+((($A13-$A14)/($A12-$A14))*(N12-N14))","v":0},1.8299999999999998,{"$f":"P14+((($A13-$A14)/($A12-$A14))*(P12-P14))","v":1.27},1.4500000000000002,{"$f":"R14+((($A13-$A14)/($A12-$A14))*(R12-R14))","v":1.0899999999999999},1.3499999999999999,{"$f":"T14+((($A13-$A14)/($A12-$A14))*(T12-T14))","v":0.95999999999999985},1.2899999999999987,{"$f":"V14+((($A13-$A14)/($A12-$A14))*(V12-V14))","v":0.8500000000000002},0.97000000000000164,{"$f":"X14+((($A13-$A14)/($A12-$A14))*(X12-X14))","v":0.81999999999999984},1.093333333333333,{"$f":"Z14+((($A13-$A14)/($A12-$A14))*(Z12-Z14))","v":0},1.8299999999999998,{"$f":"AB14+((($A13-$A14)/($A12-$A14))*(AB12-AB14))","v":1.21},1.44,{"$f":"AD14+((($A13-$A14)/($A12-$A14))*(AD12-AD14))","v":0.97999999999999987},1.2599999999999998,{"$f":"AF14+((($A13-$A14)/($A12-$A14))*(AF12-AF14))","v":0.83999999999999986},1.1100000000000001,{"$f":"AH14+((($A13-$A14)/($A12-$A14))*(AH12-AH14))","v":0.74999999999999978},1.0299999999999983,{"$f":"AJ14+((($A13-$A14)/($A12-$A14))*(AJ12-AJ14))","v":0.68000000000000016},0.90666666666666684,{"$f":"AL14+((($A13-$A14)/($A12-$A14))*(AL12-AL14))","v":0}]
[4,0.99,0.99,0.79,0.85000000000000009,0.73,0.81,0.69,0.74999999999999967,0.67,0.75000000000000011,0.65,0.8666666666666667,0,0.99,0.75,0.85,0.65,0.75000000000000011,0.6,0.69000000000000006,0.56999999999999995,0.68999999999999961,0.54,0.72,0,0.99,0.73,0.84,0.62,0.73999999999999988,0.56000000000000005,0.71000000000000019,0.51,0.63000000000000012,0.48,0.6399999999999999,0]
[{"$f":"IF((AND(A14<$B$40,A16>$B$40)),$B$40,\"0,0\")","v":"0,0"},{"$f":"B16+((($A15-$A16)/($A14-$A16))*(B14-B16))","v":1.55},1.55,{"$f":"D16+((($A15-$A16)/($A14-$A16))*(D14-D16))","v":1.1900000000000004},1.2900000000000009,{"$f":"F16+((($A15-$A16)/($A14-$A16))*(F14-F16))","v":1.0899999999999999},1.25,{"$f":"H16+((($A15-$A16)/($A14-$A16))*(H14-H16))","v":1.0099999999999998},1.0699999999999981,{"$f":"J16+((($A15-$A16)/($A14-$A16))*(J14-J16))","v":0.99000000000000032},1.2300000000000004,{"$f":"L16+((($A15-$A16)/($A14-$A16))*(L14-L16))","v":0.93000000000000027},1.2400000000000002,{"$f":"N16+((($A15-$A16)/($A14-$A16))*(N14-N16))","v":0},1.55,{"$f":"P16+((($A15-$A16)/($A14-$A16))*(P14-P16))","v":1.1499999999999999},1.3699999999999997,{"$f":"R16+((($A15-$A16)/($A14-$A16))*(R14-R16))","v":0.93000000000000027},1.1100000000000012,{"$f":"T16+((($A15-$A16)/($A14-$A16))*(T14-T16))","v":0.83999999999999975},0.92999999999999983,{"$f":"V16+((($A15-$A16)/($A14-$A16))*(V14-V16))","v":0.80999999999999972},1.0899999999999976,{"$f":"X16+((($A15-$A16)/($A14-$A16))*(X14-X16))","v":0.74000000000000021},0.98666666666666691,{"$f":"Z16+((($A15-$A16)/($A14-$A16))*(Z14-Z16))","v":0},1.55,{"$f":"AB16+((($A15-$A16)/($A14-$A16))*(AB14-AB16))","v":1.0899999999999999},1.2799999999999998,{"$f":"AD16+((($A15-$A16)/($A14-$A16))*(AD14-AD16))","v":0.8999999999999998},1.0999999999999988,{"$f":"AF16+((($A15-$A16)/($A14-$A16))*(AF14-AF16))","v":0.80000000000000027},1.1900000000000006,{"$f":"AH16+((($A15-$A16)/($A14-$A16))*(AH14-AH16))","v":0.67000000000000015},0.79000000000000115,{"$f":"AJ16+((($A15-$A16)/($A14-$A16))*(AJ14-AJ16))","v":0.6399999999999999},0.85333333333333317,{"$f":"AL16+((($A15-$A16)/($A14-$A16))*(AL14-AL16))","v":0}]
[5,0.85,0.85,0.69,0.73999999999999988,0.64,0.70000000000000007,0.61,0.67,0.59,0.63,0.57999999999999996,0.77333333333333321,0,0.85,0.65,0.72000000000000008,0.57999999999999996,0.65999999999999981,0.54,0.63000000000000012,0.51,0.59000000000000008,0.49,0.65333333333333332,0,0.85,0.64,0.73,0.55000000000000004,0.65000000000000013,0.5,0.59000000000000008,0.47,0.58999999999999986,0.44,0.58666666666666667,0]
[{"$f":"IF((AND(A16<$B$40,A18>$B$40)),$B$40,\"0,0\")","v":"0,0"},{"$f":"B18+((($A17-$A18)/($A16-$A18))*(B16-B18))","v":1.4},1.4,{"$f":"D18+((($A17-$A18)/($A16-$A18))*(D16-D18))","v":1.0899999999999999},1.1899999999999995,{"$f":"F18+((($A17-$A18)/($A16-$A18))*(F16-F18))","v":0.99000000000000032},1.0500000000000016,{"$f":"H18+((($A17-$A18)/($A16-$A18))*(H16-H18))","v":0.95999999999999974},1.17,{"$f":"J18+((($A17-$A18)/($A16-$A18))*(J16-J18))","v":0.88999999999999968},0.92999999999999972,{"$f":"L18+((($A17-$A18)/($A16-$A18))*(L16-L18))","v":0.87999999999999967},1.1733333333333329,{"$f":"N18+((($A17-$A18)/($A16-$A18))*(N16-N18))","v":0},1.4,{"$f":"P18+((($A17-$A18)/($A16-$A18))*(P16-P18))","v":1.0000000000000004},1.1200000000000012,{"$f":"R18+((($A17-$A18)/($A16-$A18))*(R16-R18))","v":0.87999999999999967},0.95999999999999841,{"$f":"T18+((($A17-$A18)/($A16-$A18))*(T16-T18))","v":0.8400000000000003},1.0800000000000012,{"$f":"V18+((($A17-$A18)/($A16-$A18))*(V16-V18))","v":0.76},0.84000000000000008,{"$f":"X18+((($A17-$A18)/($A16-$A18))*(X16-X18))","v":0.74},0.98666666666666658,{"$f":"Z18+((($A17-$A18)/($A16-$A18))*(Z16-Z18))","v":0},1.4,{"$f":"AB18+((($A17-$A18)/($A16-$A18))*(AB16-AB18))","v":0.99000000000000032},1.1800000000000004,{"$f":"AD18+((($A17-$A18)/($A16-$A18))*(AD16-AD18))","v":0.80000000000000027},0.9000000000000008,{"$f":"AF18+((($A17-$A18)/($A16-$A18))*(AF16-AF18))","v":0.75},0.99000000000000021,{"$f":"AH18+((($A17-$A18)/($A16-$A18))*(AH16-AH18))","v":0.66999999999999993},0.98999999999999932,{"$f":"AJ18+((($A17-$A18)/($A16-$A18))*(AJ16-AJ18))","v":0.59000000000000008},0.78666666666666674,{"$f":"AL18+((($A17-$A18)/($A16-$A18))*(AL16-AL18))","v":0}]
[6,0.74,0.74,0.61,0.65,0.56999999999999995,0.62999999999999978,0.54,0.57000000000000006,0.53,0.57000000000000006,0.52,0.69333333333333336,0,0.74,0.57999999999999996,0.6399999999999999,0.52,0.60000000000000009,0.48,0.53999999999999981,0.46,0.54,0.44,0.58666666666666667,0,0.74,0.56999999999999995,0.6399999999999999,0.5,0.6,0.45,0.51,0.43,0.51,0.41,0.54666666666666663,0]
[{"$f":"IF((AND(A18<$B$40,A20>$B$40)),$B$40,\"0,0\")","v":"0,0"},{"$f":"B20+((($A19-$A20)/($A18-$A20))*(B18-B20))","v":1.2199999999999998},1.2199999999999998,{"$f":"D20+((($A19-$A20)/($A18-$A20))*(D18-D20))","v":0.96999999999999964},1.0099999999999998,{"$f":"F20+((($A19-$A20)/($A18-$A20))*(F18-F20))","v":0.9299999999999996},1.1099999999999981,{"$f":"H20+((($A19-$A20)/($A18-$A20))*(H18-H20))","v":0.8400000000000003},0.87000000000000033,{"$f":"J20+((($A19-$A20)/($A18-$A20))*(J18-J20))","v":0.83000000000000029},0.87000000000000033,{"$f":"L20+((($A19-$A20)/($A18-$A20))*(L18-L20))","v":0.82000000000000028},1.0933333333333337,{"$f":"N20+((($A19-$A20)/($A18-$A20))*(N18-N20))","v":0},1.2199999999999998,{"$f":"P20+((($A19-$A20)/($A18-$A20))*(P18-P20))","v":0.87999999999999956},0.93999999999999884,{"$f":"R20+((($A19-$A20)/($A18-$A20))*(R18-R20))","v":0.82000000000000028},1.0200000000000011,{"$f":"T20+((($A19-$A20)/($A18-$A20))*(T18-T20))","v":0.71999999999999986},0.77999999999999892,{"$f":"V20+((($A19-$A20)/($A18-$A20))*(V18-V20))","v":0.70000000000000018},1.0200000000000005,{"$f":"X20+((($A19-$A20)/($A18-$A20))*(X18-X20))","v":0.62000000000000011},0.82666666666666677,{"$f":"Z20+((($A19-$A20)/($A18-$A20))*(Z18-Z20))","v":0},1.2199999999999998,{"$f":"AB20+((($A19-$A20)/($A18-$A20))*(AB18-AB20))","v":0.9299999999999996},1.0599999999999992,{"$f":"AD20+((($A19-$A20)/($A18-$A20))*(AD18-AD20))","v":0.79999999999999993},1.1399999999999997,{"$f":"AF20+((($A19-$A20)/($A18-$A20))*(AF18-AF20))","v":0.63000000000000012},0.51000000000000068,{"$f":"AH20+((($A19-$A20)/($A18-$A20))*(AH18-AH20))","v":0.66999999999999993},0.75,{"$f":"AJ20+((($A19-$A20)/($A18-$A20))*(AJ18-AJ20))","v":0.64999999999999991},0.86666666666666647,{"$f":"AL20+((($A19-$A20)/($A18-$A20))*(AL18-AL20))","v":0}]
[7,0.66,0.66,0.55000000000000004,0.59000000000000008,0.51,0.55000000000000004,0.49,0.52,0.48,0.52,0.47,0.62666666666666659,0,0.66,0.53,0.59000000000000008,0.47,0.52999999999999992,0.44,0.5,0.42,0.46,0.41,0.54666666666666663,0,0.66,0.51,0.57000000000000006,0.45,0.51,0.42,0.5099999999999999,0.39,0.47000000000000008,0.37,0.49333333333333329,0]
[{"$f":"IF((AND(A20<$B$40,A22>$B$40)),$B$40,\"0,0\")","v":"0,0"},{"$f":"B22+((($A21-$A22)/($A20-$A22))*(B20-B22))","v":1.0800000000000005},1.0800000000000005,{"$f":"D22+((($A21-$A22)/($A20-$A22))*(D20-D22))","v":0.90000000000000036},1.0100000000000005,{"$f":"F22+((($A21-$A22)/($A20-$A22))*(F20-F22))","v":0.79000000000000026},0.83000000000000118,{"$f":"H22+((($A21-$A22)/($A20-$A22))*(H20-H22))","v":0.7699999999999998},0.79999999999999982,{"$f":"J22+((($A21-$A22)/($A20-$A22))*(J20-J22))","v":0.75999999999999979},0.79999999999999982,{"$f":"L22+((($A21-$A22)/($A20-$A22))*(L20-L22))","v":0.74999999999999978},0.99999999999999967,{"$f":"N22+((($A21-$A22)/($A20-$A22))*(N20-N22))","v":0},1.0800000000000005,{"$f":"P22+((($A21-$A22)/($A20-$A22))*(P20-P22))","v":0.88000000000000034},1.0100000000000009,{"$f":"R22+((($A21-$A22)/($A20-$A22))*(R20-R22))","v":0.74999999999999978},0.94999999999999907,{"$f":"T22+((($A21-$A22)/($A20-$A22))*(T20-T22))","v":0.65000000000000013},0.71000000000000119,{"$f":"V22+((($A21-$A22)/($A20-$A22))*(V20-V22))","v":0.62999999999999978},0.66999999999999982,{"$f":"X22+((($A21-$A22)/($A20-$A22))*(X20-X22))","v":0.61999999999999977},0.82666666666666633,{"$f":"Z22+((($A21-$A22)/($A20-$A22))*(Z20-Z22))","v":0},1.0800000000000005,{"$f":"AB22+((($A21-$A22)/($A20-$A22))*(AB20-AB22))","v":0.79000000000000026},0.92000000000000037,{"$f":"AD22+((($A21-$A22)/($A20-$A22))*(AD20-AD22))","v":0.66000000000000014},0.58000000000000074,{"$f":"AF22+((($A21-$A22)/($A20-$A22))*(AF20-AF22))","v":0.69999999999999984},0.99999999999999878,{"$f":"AH22+((($A21-$A22)/($A20-$A22))*(AH20-AH22))","v":0.6000000000000002},0.96000000000000052,{"$f":"AJ22+((($A21-$A22)/($A20-$A22))*(AJ20-AJ22))","v":0.51000000000000012},0.68000000000000016,{"$f":"AL22+((($A21-$A22)/($A20-$A22))*(AL20-AL22))","v":0}]
[8,0.6,0.6,0.5,0.53,0.47,0.5099999999999999,0.45,0.48000000000000004,0.44,0.48000000000000004,0.43,0.57333333333333325,0,0.6,0.48,0.53,0.43,0.47000000000000003,0.41,0.46999999999999986,0.39,0.43000000000000005,0.38,0.5066666666666666,0,0.6,0.47,0.52,0.42,0.49999999999999994,0.38,0.44000000000000006,0.36,0.4,0.35,0.46666666666666662,0]
[{"$f":"IF((AND(A22<$B$40,A24>$B$40)),$B$40,\"0,0\")","v":"0,0"},{"$f":"B24+((($A23-$A24)/($A22-$A24))*(B22-B24))","v":0.99999999999999944},0.99999999999999944,{"$f":"D24+((($A23-$A24)/($A22-$A24))*(D22-D24))","v":0.81999999999999984},0.84999999999999987,{"$f":"F24+((($A23-$A24)/($A22-$A24))*(F22-F24))","v":0.78999999999999981},0.9899999999999991,{"$f":"H24+((($A23-$A24)/($A22-$A24))*(H22-H24))","v":0.69000000000000017},0.7200000000000002,{"$f":"J24+((($A23-$A24)/($A22-$A24))*(J22-J24))","v":0.68000000000000016},0.72000000000000197,{"$f":"L24+((($A23-$A24)/($A22-$A24))*(L22-L24))","v":0.66999999999999971},0.89333333333333287,{"$f":"N24+((($A23-$A24)/($A22-$A24))*(N22-N24))","v":0},0.99999999999999944,{"$f":"P24+((($A23-$A24)/($A22-$A24))*(P22-P24))","v":0.79999999999999982},0.92999999999999994,{"$f":"R24+((($A23-$A24)/($A22-$A24))*(R22-R24))","v":0.66999999999999971},0.70999999999999974,{"$f":"T24+((($A23-$A24)/($A22-$A24))*(T22-T24))","v":0.64999999999999969},0.70999999999999808,{"$f":"V24+((($A23-$A24)/($A22-$A24))*(V22-V24))","v":0.63000000000000023},0.67000000000000026,{"$f":"X24+((($A23-$A24)/($A22-$A24))*(X22-X24))","v":0.62000000000000022},0.82666666666666688,{"$f":"Z24+((($A23-$A24)/($A22-$A24))*(Z22-Z24))","v":0},0.99999999999999944,{"$f":"AB24+((($A23-$A24)/($A22-$A24))*(AB22-AB24))","v":0.78999999999999981},0.91999999999999993,{"$f":"AD24+((($A23-$A24)/($A22-$A24))*(AD22-AD24))","v":0.6599999999999997},0.8999999999999988,{"$f":"AF24+((($A23-$A24)/($A22-$A24))*(AF22-AF24))","v":0.54000000000000015},0.60000000000000153,{"$f":"AH24+((($A23-$A24)/($A22-$A24))*(AH22-AH24))","v":0.51999999999999968},0.55999999999999972,{"$f":"AJ24+((($A23-$A24)/($A22-$A24))*(AJ22-AJ24))","v":0.50999999999999968},0.67999999999999949,{"$f":"AL24+((($A23-$A24)/($A22-$A24))*(AL22-AL24))","v":0}]
[9,0.55000000000000004,0.55000000000000004,0.46,0.49000000000000005,0.43,0.45,0.42,0.45,0.41,0.44999999999999979,0.4,0.53333333333333333,0,0.55000000000000004,0.44,0.48,0.4,0.44000000000000006,0.38,0.44000000000000006,0.36,0.4,0.35,0.46666666666666662,0,0.55000000000000004,0.43,0.47,0.39,0.45000000000000007,0.36,0.41999999999999987,0.34,0.38000000000000006,0.33,0.44,0]
[{"$f":"IF((AND(A24<$B$40,A26>$B$40)),$B$40,\"0,0\")","v":"0,0"},{"$f":"B26+((($A25-$A26)/($A24-$A26))*(B24-B26))","v":0.91000000000000036},0.91000000000000036,{"$f":"D26+((($A25-$A26)/($A24-$A26))*(D24-D26))","v":0.7300000000000002},0.76000000000000068,{"$f":"F26+((($A25-$A26)/($A24-$A26))*(F24-F26))","v":0.69999999999999973},0.71999999999999975,{"$f":"H26+((($A25-$A26)/($A24-$A26))*(H24-H26))","v":0.68999999999999972},0.71999999999999975,{"$f":"J26+((($A25-$A26)/($A24-$A26))*(J24-J26))","v":0.67999999999999972},0.71999999999999753,{"$f":"L26+((($A25-$A26)/($A24-$A26))*(L24-L26))","v":0.67000000000000026},0.89333333333333365,{"$f":"N26+((($A25-$A26)/($A24-$A26))*(N24-N26))","v":0},0.91000000000000036,{"$f":"P26+((($A25-$A26)/($A24-$A26))*(P24-P26))","v":0.71000000000000019},0.75000000000000011,{"$f":"R26+((($A25-$A26)/($A24-$A26))*(R24-R26))","v":0.67000000000000026},0.7100000000000003,{"$f":"T26+((($A25-$A26)/($A24-$A26))*(T24-T26))","v":0.65000000000000024},0.9800000000000022,{"$f":"V26+((($A25-$A26)/($A24-$A26))*(V24-V26))","v":0.53999999999999959},0.57999999999999963,{"$f":"X26+((($A25-$A26)/($A24-$A26))*(X24-X26))","v":0.52999999999999958},0.70666666666666611,{"$f":"Z26+((($A25-$A26)/($A24-$A26))*(Z24-Z26))","v":0},0.91000000000000036,{"$f":"AB26+((($A25-$A26)/($A24-$A26))*(AB24-AB26))","v":0.69999999999999973},0.73999999999999921,{"$f":"AD26+((($A25-$A26)/($A24-$A26))*(AD24-AD26))","v":0.66000000000000025},0.90000000000000158,{"$f":"AF26+((($A25-$A26)/($A24-$A26))*(AF24-AF26))","v":0.53999999999999959},0.59999999999999765,{"$f":"AH26+((($A25-$A26)/($A24-$A26))*(AH24-AH26))","v":0.52000000000000024},0.56000000000000028,{"$f":"AJ26+((($A25-$A26)/($A24-$A26))*(AJ24-AJ26))","v":0.51000000000000023},0.68000000000000027,{"$f":"AL26+((($A25-$A26)/($A24-$A26))*(AL24-AL26))","v":0}]
[10,0.51,0.51,0.43,0.45999999999999996,0.4,0.42000000000000004,0.39,0.42000000000000004,0.38,0.42000000000000004,0.37,0.49333333333333329,0,0.51,0.41,0.44999999999999996,0.37,0.41000000000000003,0.35,0.37999999999999984,0.34,0.38000000000000006,0.33,0.44,0,0.51,0.4,0.44000000000000006,0.36,0.39999999999999991,0.34,0.40000000000000008,0.32,0.36000000000000004,0.31,0.41333333333333333,0]
[{"$f":"IF((AND(A26<$B$40,A28>$B$40)),$B$40,\"0,0\")","v":"0,0"},{"$f":"B28+((($A27-$A28)/($A26-$A28))*(B26-B28))","v":0.8600000000000001},0.8600000000000001,{"$f":"D28+((($A27-$A28)/($A26-$A28))*(D26-D28))","v":0.67999999999999994},0.75999999999999968,{"$f":"F28+((($A27-$A28)/($A26-$A28))*(F26-F28))","v":0.6000000000000002},0.52000000000000079,{"$f":"H28+((($A27-$A28)/($A26-$A28))*(H26-H28))","v":0.6399999999999999},0.82000000000000006,{"$f":"J28+((($A27-$A28)/($A26-$A28))*(J26-J28))","v":0.57999999999999985},0.61999999999999988,{"$f":"L28+((($A27-$A28)/($A26-$A28))*(L26-L28))","v":0.56999999999999984},0.75999999999999979,{"$f":"N28+((($A27-$A28)/($A26-$A28))*(N26-N28))","v":0},0.8600000000000001,{"$f":"P28+((($A27-$A28)/($A26-$A28))*(P26-P28))","v":0.65999999999999992},0.75,{"$f":"R28+((($A27-$A28)/($A26-$A28))*(R26-R28))","v":0.56999999999999984},0.60999999999999988,{"$f":"T28+((($A27-$A28)/($A26-$A28))*(T26-T28))","v":0.54999999999999982},0.57999999999999852,{"$f":"V28+((($A27-$A28)/($A26-$A28))*(V26-V28))","v":0.54000000000000026},0.58000000000000029,{"$f":"X28+((($A27-$A28)/($A26-$A28))*(X26-X28))","v":0.53000000000000025},0.706666666666667,{"$f":"Z28+((($A27-$A28)/($A26-$A28))*(Z26-Z28))","v":0},0.8600000000000001,{"$f":"AB28+((($A27-$A28)/($A26-$A28))*(AB26-AB28))","v":0.6000000000000002},0.64000000000000057,{"$f":"AD28+((($A27-$A28)/($A26-$A28))*(AD26-AD28))","v":0.55999999999999983},0.59999999999999898,{"$f":"AF28+((($A27-$A28)/($A26-$A28))*(AF26-AF28))","v":0.54000000000000026},0.60000000000000131,{"$f":"AH28+((($A27-$A28)/($A26-$A28))*(AH26-AH28))","v":0.51999999999999991},0.55999999999999994,{"$f":"AJ28+((($A27-$A28)/($A26-$A28))*(AJ26-AJ28))","v":0.5099999999999999},0.67999999999999983,{"$f":"AL28+((($A27-$A28)/($A26-$A28))*(AL26-AL28))","v":0}]
[12,0.44,0.44,0.38,0.4,0.36,0.39999999999999991,0.34,0.34,0.34,0.38000000000000006,0.33,0.44,0,0.44,0.36,0.38999999999999996,0.33,0.37000000000000005,0.31,0.34,0.3,0.34,0.28999999999999998,0.3866666666666666,0,0.44,0.36,0.39999999999999997,0.32,0.36000000000000004,0.3,0.35999999999999988,0.28000000000000003,0.32000000000000006,0.27,0.36,0]
[{"$f":"IF((AND(A28<$B$40,A30>$B$40)),$B$40,\"0,0\")","v":"0,0"},{"$f":"B30+((($A29-$A30)/($A28-$A30))*(B28-B30))","v":0.74},0.74,{"$f":"D30+((($A29-$A30)/($A28-$A30))*(D28-D30))","v":0.61999999999999988},0.6399999999999999,{"$f":"F30+((($A29-$A30)/($A28-$A30))*(F28-F30))","v":0.59999999999999987},0.75999999999999912,{"$f":"H30+((($A29-$A30)/($A28-$A30))*(H28-H30))","v":0.52000000000000024},0.34000000000000008,{"$f":"J30+((($A29-$A30)/($A28-$A30))*(J28-J30))","v":0.58000000000000029},0.86000000000000054,{"$f":"L30+((($A29-$A30)/($A28-$A30))*(L28-L30))","v":0.51000000000000023},0.68000000000000027,{"$f":"N30+((($A29-$A30)/($A28-$A30))*(N28-N30))","v":0},0.74,{"$f":"P30+((($A29-$A30)/($A28-$A30))*(P28-P30))","v":0.59999999999999987},0.6899999999999995,{"$f":"R30+((($A29-$A30)/($A28-$A30))*(R28-R30))","v":0.51000000000000023},0.55000000000000104,{"$f":"T30+((($A29-$A30)/($A28-$A30))*(T28-T30))","v":0.48999999999999982},0.5199999999999998,{"$f":"V30+((($A29-$A30)/($A28-$A30))*(V28-V30))","v":0.47999999999999982},0.76,{"$f":"X30+((($A29-$A30)/($A28-$A30))*(X28-X30))","v":0.40999999999999975},0.5466666666666663,{"$f":"Z30+((($A29-$A30)/($A28-$A30))*(Z28-Z30))","v":0},0.74,{"$f":"AB30+((($A29-$A30)/($A28-$A30))*(AB28-AB30))","v":0.59999999999999987},0.69999999999999951,{"$f":"AD30+((($A29-$A30)/($A28-$A30))*(AD28-AD30))","v":0.50000000000000022},0.54000000000000103,{"$f":"AF30+((($A29-$A30)/($A28-$A30))*(AF28-AF30))","v":0.47999999999999982},0.71999999999999886,{"$f":"AH30+((($A29-$A30)/($A28-$A30))*(AH28-AH30))","v":0.40000000000000013},0.44000000000000017,{"$f":"AJ30+((($A29-$A30)/($A28-$A30))*(AJ28-AJ30))","v":0.39000000000000012},0.52000000000000013,{"$f":"AL30+((($A29-$A30)/($A28-$A30))*(AL28-AL30))","v":0}]
[14,0.39,0.39,0.34,0.36000000000000004,0.32,0.34,0.31,0.34,0.3,0.3,0.3,0.39999999999999997,0,0.39,0.32,0.34,0.3,0.33999999999999991,0.28000000000000003,0.31000000000000005,0.27,0.27,0.27,0.36,0,0.39,0.32,0.35000000000000003,0.28999999999999998,0.3299999999999999,0.27,0.30000000000000004,0.26,0.30000000000000004,0.25,0.33333333333333331,0]
[{"$f":"IF((AND(A30<$B$40,A32>$B$40)),$B$40,\"0,0\")","v":"0,0"},{"$f":"B32+((($A31-$A32)/($A30-$A32))*(B30-B32))","v":0.67000000000000026},0.67000000000000026,{"$f":"D32+((($A31-$A32)/($A30-$A32))*(D30-D32))","v":0.55000000000000027},0.57000000000000028,{"$f":"F32+((($A31-$A32)/($A30-$A32))*(F30-F32))","v":0.53000000000000025},0.55000000000000115,{"$f":"H32+((($A31-$A32)/($A30-$A32))*(H30-H32))","v":0.5199999999999998},0.54999999999999982,{"$f":"J32+((($A31-$A32)/($A30-$A32))*(J30-J32))","v":0.50999999999999979},0.50999999999999979,{"$f":"L32+((($A31-$A32)/($A30-$A32))*(L30-L32))","v":0.50999999999999979},0.67999999999999972,{"$f":"N32+((($A31-$A32)/($A30-$A32))*(N30-N32))","v":0},0.67000000000000026,{"$f":"P32+((($A31-$A32)/($A30-$A32))*(P30-P32))","v":0.53000000000000025},0.55000000000000071,{"$f":"R32+((($A31-$A32)/($A30-$A32))*(R30-R32))","v":0.50999999999999979},0.68999999999999906,{"$f":"T32+((($A31-$A32)/($A30-$A32))*(T30-T32))","v":0.42000000000000015},0.45000000000000018,{"$f":"V32+((($A31-$A32)/($A30-$A32))*(V30-V32))","v":0.41000000000000014},0.12999999999999989,{"$f":"X32+((($A31-$A32)/($A30-$A32))*(X30-X32))","v":0.4800000000000002},0.64000000000000024,{"$f":"Z32+((($A31-$A32)/($A30-$A32))*(Z30-Z32))","v":0},0.67000000000000026,{"$f":"AB32+((($A31-$A32)/($A30-$A32))*(AB30-AB32))","v":0.53000000000000025},0.56000000000000072,{"$f":"AD32+((($A31-$A32)/($A30-$A32))*(AD30-AD32))","v":0.49999999999999978},0.67999999999999905,{"$f":"AF32+((($A31-$A32)/($A30-$A32))*(AF30-AF32))","v":0.41000000000000014},0.44000000000000017,{"$f":"AH32+((($A31-$A32)/($A30-$A32))*(AH30-AH32))","v":0.40000000000000013},0.44000000000000106,{"$f":"AJ32+((($A31-$A32)/($A30-$A32))*(AJ30-AJ32))","v":0.3899999999999999},0.5199999999999998,{"$f":"AL32+((($A31-$A32)/($A30-$A32))*(AL30-AL32))","v":0}]
[16,0.35,0.35,0.31,0.33,0.28999999999999998,0.30999999999999989,0.28000000000000003,0.31000000000000005,0.27,0.27,0.27,0.36,0,0.35,0.28999999999999998,0.30999999999999994,0.27,0.29000000000000004,0.26,0.29000000000000004,0.25,0.29000000000000004,0.24,0.31999999999999995,0,0.35,0.28999999999999998,0.31999999999999995,0.26,0.28000000000000003,0.25,0.28000000000000003,0.24,0.27999999999999992,0.23,0.30666666666666664,0]
[{"$f":"IF((AND(A32<$B$40,A34>$B$40)),$B$40,\"0,0\")","v":"0,0"},{"$f":"B34+((($A33-$A34)/($A32-$A34))*(B32-B34))","v":0.58999999999999975},0.58999999999999975,{"$f":"D34+((($A33-$A34)/($A32-$A34))*(D32-D34))","v":0.54999999999999982},0.64999999999999991,{"$f":"F34+((($A33-$A34)/($A32-$A34))*(F32-F34))","v":0.44999999999999968},0.4699999999999987,{"$f":"H34+((($A33-$A34)/($A32-$A34))*(H32-H34))","v":0.44000000000000017},0.4700000000000002,{"$f":"J34+((($A33-$A34)/($A32-$A34))*(J32-J34))","v":0.43000000000000016},0.43000000000000016,{"$f":"L34+((($A33-$A34)/($A32-$A34))*(L32-L34))","v":0.43000000000000016},0.57333333333333347,{"$f":"N34+((($A33-$A34)/($A32-$A34))*(N32-N34))","v":0},0.58999999999999975,{"$f":"P34+((($A33-$A34)/($A32-$A34))*(P32-P34))","v":0.44999999999999968},0.4699999999999992,{"$f":"R34+((($A33-$A34)/($A32-$A34))*(R32-R34))","v":0.43000000000000016},0.45000000000000018,{"$f":"T34+((($A33-$A34)/($A32-$A34))*(T32-T34))","v":0.42000000000000015},0.45000000000000084,{"$f":"V34+((($A33-$A34)/($A32-$A34))*(V32-V34))","v":0.40999999999999992},0.44999999999999996,{"$f":"X34+((($A33-$A34)/($A32-$A34))*(X32-X34))","v":0.39999999999999991},0.53333333333333321,{"$f":"Z34+((($A33-$A34)/($A32-$A34))*(Z32-Z34))","v":0},0.58999999999999975,{"$f":"AB34+((($A33-$A34)/($A32-$A34))*(AB32-AB34))","v":0.44999999999999968},0.47999999999999921,{"$f":"AD34+((($A33-$A34)/($A32-$A34))*(AD32-AD34))","v":0.42000000000000015},0.44000000000000061,{"$f":"AF34+((($A33-$A34)/($A32-$A34))*(AF32-AF34))","v":0.40999999999999992},0.43999999999999995,{"$f":"AH34+((($A33-$A34)/($A32-$A34))*(AH32-AH34))","v":0.39999999999999991},0.43999999999999906,{"$f":"AJ34+((($A33-$A34)/($A32-$A34))*(AJ32-AJ34))","v":0.39000000000000012},0.52000000000000013,{"$f":"AL34+((($A33-$A34)/($A32-$A34))*(AL32-AL34))","v":0}]
[18,0.32,0.32,0.28000000000000003,0.29000000000000004,0.27,0.29000000000000004,0.26,0.29000000000000004,0.25,0.25,0.25,0.33333333333333331,0,0.32,0.27,0.29000000000000004,0.25,0.27,0.24,0.26999999999999991,0.23,0.27,0.22,0.29333333333333333,0,0.32,0.27,0.30000000000000004,0.24,0.25999999999999995,0.23,0.26,0.22,0.26,0.21,0.27999999999999997,0]
[{"$f":"IF((AND(A34<$B$40,A36>$B$40)),$B$40,\"0,0\")","v":"0,0"},{"$f":"B36+((($A35-$A36)/($A34-$A36))*(B34-B36))","v":0.50000000000000022},0.50000000000000022,{"$f":"D36+((($A35-$A36)/($A34-$A36))*(D34-D36))","v":0.46000000000000019},0.4700000000000002,{"$f":"F36+((($A35-$A36)/($A34-$A36))*(F34-F36))","v":0.45000000000000018},0.4700000000000002,{"$f":"H36+((($A35-$A36)/($A34-$A36))*(H34-H36))","v":0.44000000000000017},0.47000000000000086,{"$f":"J36+((($A35-$A36)/($A34-$A36))*(J34-J36))","v":0.42999999999999994},0.42999999999999994,{"$f":"L36+((($A35-$A36)/($A34-$A36))*(L34-L36))","v":0.42999999999999994},0.57333333333333325,{"$f":"N36+((($A35-$A36)/($A34-$A36))*(N34-N36))","v":0},0.50000000000000022,{"$f":"P36+((($A35-$A36)/($A34-$A36))*(P34-P36))","v":0.45000000000000018},0.47000000000000042,{"$f":"R36+((($A35-$A36)/($A34-$A36))*(R34-R36))","v":0.42999999999999994},0.44999999999999996,{"$f":"T36+((($A35-$A36)/($A34-$A36))*(T34-T36))","v":0.41999999999999993},0.44999999999999929,{"$f":"V36+((($A35-$A36)/($A34-$A36))*(V34-V36))","v":0.41000000000000014},0.8100000000000005,{"$f":"X36+((($A35-$A36)/($A34-$A36))*(X34-X36))","v":0.31000000000000005},0.41333333333333339,{"$f":"Z36+((($A35-$A36)/($A34-$A36))*(Z34-Z36))","v":0},0.50000000000000022,{"$f":"AB36+((($A35-$A36)/($A34-$A36))*(AB34-AB36))","v":0.45000000000000018},0.48000000000000043,{"$f":"AD36+((($A35-$A36)/($A34-$A36))*(AD34-AD36))","v":0.41999999999999993},0.4399999999999995,{"$f":"AF36+((($A35-$A36)/($A34-$A36))*(AF34-AF36))","v":0.41000000000000014},0.44000000000000083,{"$f":"AH36+((($A35-$A36)/($A34-$A36))*(AH34-AH36))","v":0.39999999999999991},0.80000000000000027,{"$f":"AJ36+((($A35-$A36)/($A34-$A36))*(AJ34-AJ36))","v":0.29999999999999982},0.39999999999999974,{"$f":"AL36+((($A35-$A36)/($A34-$A36))*(AL34-AL36))","v":0}]
[20,0.3,0.3,0.26,0.27,0.25,0.27,0.24,0.26999999999999991,0.23,0.23,0.23,0.30666666666666664,0,0.3,0.25,0.27,0.23,0.25,0.22,0.25,0.21,0.21,0.21,0.27999999999999997,0,0.3,0.25,0.28000000000000003,0.22,0.24000000000000002,0.21,0.23999999999999994,0.2,0.2,0.2,0.26666666666666666,0]
[{"$f":"IF((AND(A36<$B$40,A38>$B$40)),$B$40,\"0,0\")","v":"0,0"},{"$f":"B38+((($A37-$A38)/($A36-$A38))*(B36-B38))","v":0.3},0.3,{"$f":"D38+((($A37-$A38)/($A36-$A38))*(D36-D38))","v":0.26},0.27,{"$f":"F38+((($A37-$A38)/($A36-$A38))*(F36-F38))","v":0.25},0.27,{"$f":"H38+((($A37-$A38)/($A36-$A38))*(H36-H38))","v":0.24},0.26999999999999991,{"$f":"J38+((($A37-$A38)/($A36-$A38))*(J36-J38))","v":0.23},0.23,{"$f":"L38+((($A37-$A38)/($A36-$A38))*(L36-L38))","v":0.23},0.30666666666666664,{"$f":"N38+((($A37-$A38)/($A36-$A38))*(N36-N38))","v":0},0.3,{"$f":"P38+((($A37-$A38)/($A36-$A38))*(P36-P38))","v":0.25},0.27,{"$f":"R38+((($A37-$A38)/($A36-$A38))*(R36-R38))","v":0.23},0.25,{"$f":"T38+((($A37-$A38)/($A36-$A38))*(T36-T38))","v":0.22},0.25,{"$f":"V38+((($A37-$A38)/($A36-$A38))*(V36-V38))","v":0.21},0.21,{"$f":"X38+((($A37-$A38)/($A36-$A38))*(X36-X38))","v":0.21},0.27999999999999997,{"$f":"Z38+((($A37-$A38)/($A36-$A38))*(Z36-Z38))","v":0},0.3,{"$f":"AB38+((($A37-$A38)/($A36-$A38))*(AB36-AB38))","v":0.25},0.28000000000000003,{"$f":"AD38+((($A37-$A38)/($A36-$A38))*(AD36-AD38))","v":0.22},0.24000000000000002,{"$f":"AF38+((($A37-$A38)/($A36-$A38))*(AF36-AF38))","v":0.21},0.23999999999999994,{"$f":"AH38+((($A37-$A38)/($A36-$A38))*(AH36-AH38))","v":0.2},0.2,{"$f":"AJ38+((($A37-$A38)/($A36-$A38))*(AJ36-AJ38))","v":0.2},0.26666666666666666,{"$f":"AL38+((($A37-$A38)/($A36-$A38))*(AL36-AL38))","v":0}]
[1000,{"$f":"B36","v":0.3},0.3,{"$f":"D36","v":0.26},0.27,0.25,0.27,0.24,0.26999999999999991,0.23,0.23,0.23,0.30666666666666664,0,0.3,0.25,0.27,0.23,0.25,0.22,0.25,0.21,0.21,0.21,0.27999999999999997,0,0.3,0.25,0.28000000000000003,0.22,0.24000000000000002,0.21,0.23999999999999994,0.2,0.2,0.2,0.26666666666666666,0]
[]
["B'",{"$f":"IF(Cerramiento!G3=\"ESTIMADOS\",Auxiliar!AF31,'Datos necesarios'!H24)","v":""},null,"Ra",{"$f":"'Recop. Datos'!G8","v":0},1,"Us (0,0)",{"$f":"IFERROR((INDEX(B6:B38,MATCH(B40,A6:A38,0))),0)","v":0}]
[null,null,null,null,null,2,"Us (0,5)",{"$f":"IFERROR((INDEX(C6:N38,MATCH(B40,A6:A38,0),MATCH(E40,C5:N5,0))),0)","v":0}]
[null,null,null,null,null,3,"Us (1,0)",{"$f":"IFERROR((INDEX(O6:Z38,MATCH(B40,A6:A38,0),MATCH(E40,O5:Z5,0))),0)","v":0}]
[null,null,null,null,null,4,"Us (1,5)",{"$f":"IFERROR((INDEX(AA6:AL38,MATCH(B40,A6:A38,0),MATCH(E40,AA5:AL5,0))),0)","v":0}]

{"sheet":"Tabla4","index":9,"n_rows":43,"n_cols":37,"rows_kept":43,"cut":false,"hidden":true,"merged":[[2,30,2,34],[3,30,3,34],[0,0,1,36],[2,3,2,7],[3,3,3,7],[2,12,2,16],[3,12,3,16],[2,21,2,25],[3,21,3,25]]}
["Tabla 4. TRANSMITANCIA TÉRMICA Us [W/m²K]"]
[]
[null,null,null,"0,5 m < z ≤ 1,0 m",null,null,null,null,null,null,null,null,"1,0 m < z ≤ 2,0 m",null,null,null,null,null,null,null,null,"2,0 m < z ≤ 3,0 m",null,null,null,null,null,null,null,null,"z > 3,0 m"]
[null,null,null,"Rf [m²\u0097K/ W]",null,null,null,null,null,null,null,null,"Rf [m²\u0097K/ W]",null,null,null,null,null,null,null,null,"Rf [m²\u0097K/ W]",null,null,null,null,null,null,null,null,"Rf [m²\u0097K/ W]"]
["B'",0,{"$f":"IF((AND(B5<$E$40,D5>$E$40)),$E$40,\"0,00\")","v":"0,00"},0.5,{"$f":"IF((AND(D5<$E$40,F5>$E$40)),$E$40,\"0,00\")","v":"0,00"},1,{"$f":"IF((AND(F5<$E$40,H5>$E$40)),$E$40,\"0,00\")","v":"0,00"},1.5,{"$f":"IF((AND(H5<$E$40,J5>$E$40)),$E$40,\"0,00\")","v":"0,00"},10,0,{"$f":"IF((AND(K5<$E$40,M5>$E$40)),$E$40,\"0,00\")","v":"0,00"},0.5,{"$f":"IF((AND(M5<$E$40,O5>$E$40)),$E$40,\"0,00\")","v":"0,00"},1,{"$f":"IF((AND(O5<$E$40,Q5>$E$40)),$E$40,\"0,00\")","v":"0,00"},1.5,{"$f":"IF((AND(Q5<$E$40,S5>$E$40)),$E$40,\"0,00\")","v":"0,00"},10,0,{"$f":"IF((AND(T5<$E$40,V5>$E$40)),$E$40,\"0,00\")","v":"0,00"},0.5,{"$f":"IF((AND(V5<$E$40,X5>$E$40)),$E$40,\"0,00\")","v":"0,00"},1,{"$f":"IF((AND(X5<$E$40,Z5>$E$40)),$E$40,\"0,00\")","v":"0,00"},1.5,{"$f":"IF((AND(Z5<$E$40,AB5>$E$40)),$E$40,\"0,00\")","v":"0,00"},10,0,{"$f":"IF((AND(AC5<$E$40,AE5>$E$40)),$E$40,\"0,00\")","v":"0,00"},0.5,{"$f":"IF((AND(AE5<$E$40,AG5>$E$40)),$E$40,\"0,00\")","v":"0,00"},1,{"$f":"IF((AND(AG5<$E$40,AI5>$E$40)),$E$40,\"0,00\")","v":"0,00"},1.5,{"$f":"IF((AND(AI5<$E$40,AK5>$E$40)),$E$40,\"0,00\")","v":"0,00"},10]
[0,{"$f":"B10+((($A$6-$A$10)/($A$8-$A$10))*(B8-B10))","v":1.93},{"$f":"B6+(((C$5-B$5)/(D$5-B$5))*(D6-B6))","v":1.93},{"$f":"D10+((($A$6-$A$10)/($A$8-$A$10))*(D8-D10))","v":1.3200000000000003},1.6300000000000008,{"$f":"F10+((($A$6-$A$10)/($A$8-$A$10))*(F8-F10))","v":1.0099999999999998},1.4099999999999995,{"$f":"H10+((($A$6-$A$10)/($A$8-$A$10))*(H8-H10))","v":0.80999999999999994},0.95294117647058818,{"$f":"J10+((($A$6-$A$10)/($A$8-$A$10))*(J8-J10))","v":0},{"$f":"K10+((($A$6-$A$10)/($A$8-$A$10))*(K8-K10))","v":1.4099999999999997},{"$f":"K6+(((L$5-K$5)/(M$5-K$5))*(M6-K6))","v":1.4099999999999997},{"$f":"M10+((($A$6-$A$10)/($A$8-$A$10))*(M8-M10))","v":1.06},{"$f":"M6+(((N$5-M$5)/(O$5-M$5))*(O6-M6))","v":1.27},{"$f":"O10+((($A$6-$A$10)/($A$8-$A$10))*(O8-O10))","v":0.85},{"$f":"O6+(((P$5-O$5)/(Q$5-O$5))*(Q6-O6))","v":1.1299999999999999},{"$f":"Q10+((($A$6-$A$10)/($A$8-$A$10))*(Q8-Q10))","v":0.71},{"$f":"Q6+(((R$5-Q$5)/(S$5-Q$5))*(S6-Q6))","v":0.83529411764705874},{"$f":"S10+((($A$6-$A$10)/($A$8-$A$10))*(S8-S10))","v":0},{"$f":"T10+((($A$6-$A$10)/($A$8-$A$10))*(T8-T10))","v":0.93},{"$f":"T6+(((U$5-T$5)/(V$5-T$5))*(V6-T6))","v":0.93},{"$f":"V10+((($A$6-$A$10)/($A$8-$A$10))*(V8-V10))","v":0.76},{"$f":"V6+(((W$5-V$5)/(X$5-V$5))*(X6-V6))","v":0.86999999999999988},{"$f":"X10+((($A$6-$A$10)/($A$8-$A$10))*(X8-X10))","v":0.65000000000000013},{"$f":"X6+(((Y$5-X$5)/(Z$5-X$5))*(Z6-X6))","v":0.83000000000000029},{"$f":"Z10+((($A$6-$A$10)/($A$8-$A$10))*(Z8-Z10))","v":0.56000000000000005},{"$f":"Z6+(((AA$5-Z$5)/(AB$5-Z$5))*(AB6-Z6))","v":0.65882352941176481},{"$f":"AB10+((($A$6-$A$10)/($A$8-$A$10))*(AB8-AB10))","v":0},{"$f":"AC10+((($A$6-$A$10)/($A$8-$A$10))*(AC8-AC10))","v":0.67999999999999994},{"$f":"AC6+(((AD$5-AC$5)/(AE$5-AC$5))*(AE6-AC6))","v":0.67999999999999994},{"$f":"AE10+((($A$6-$A$10)/($A$8-$A$10))*(AE8-AE10))","v":0.58000000000000007},{"$f":"AE6+(((AF$5-AE$5)/(AG$5-AE$5))*(AG6-AE6))","v":0.64000000000000012},{"$f":"AG10+((($A$6-$A$10)/($A$8-$A$10))*(AG8-AG10))","v":0.52},{"$f":"AG6+(((AH$5-AG$5)/(AI$5-AG$5))*(AI6-AG6))","v":0.64000000000000012},{"$f":"AI10+((($A$6-$A$10)/($A$8-$A$10))*(AI8-AI10))","v":0.45999999999999996},{"$f":"AI6+(((AJ$5-AI$5)/(AK$5-AI$5))*(AK6-AI6))","v":0.54117647058823526},{"$f":"AK10+((($A$6-$A$10)/($A$8-$A$10))*(AK8-AK10))","v":0}]
[{"$f":"IF((AND(A6<$B$40,A8>$B$40)),$B$40,\"0,0\")","v":"0,0"},{"$f":"B8+((($A7-$A8)/($A6-$A8))*(B6-B8))","v":1.93},1.93,{"$f":"D8+((($A7-$A8)/($A6-$A8))*(D6-D8))","v":1.3200000000000003},1.6300000000000008,{"$f":"F8+((($A7-$A8)/($A6-$A8))*(F6-F8))","v":1.0099999999999998},1.4099999999999995,{"$f":"H8+((($A7-$A8)/($A6-$A8))*(H6-H8))","v":0.80999999999999994},0.95294117647058818,{"$f":"J8+((($A7-$A8)/($A6-$A8))*(J6-J8))","v":0},{"$f":"K8+((($A7-$A8)/($A6-$A8))*(K6-K8))","v":1.4099999999999997},1.4099999999999997,{"$f":"M8+((($A7-$A8)/($A6-$A8))*(M6-M8))","v":1.06},1.27,{"$f":"O8+((($A7-$A8)/($A6-$A8))*(O6-O8))","v":0.85},1.1299999999999999,{"$f":"Q8+((($A7-$A8)/($A6-$A8))*(Q6-Q8))","v":0.71},0.83529411764705874,{"$f":"S8+((($A7-$A8)/($A6-$A8))*(S6-S8))","v":0},{"$f":"T8+((($A7-$A8)/($A6-$A8))*(T6-T8))","v":0.93},0.93,{"$f":"V8+((($A7-$A8)/($A6-$A8))*(V6-V8))","v":0.76},0.86999999999999988,{"$f":"X8+((($A7-$A8)/($A6-$A8))*(X6-X8))","v":0.65000000000000013},0.83000000000000029,{"$f":"Z8+((($A7-$A8)/($A6-$A8))*(Z6-Z8))","v":0.56000000000000005},0.65882352941176481,{"$f":"AB8+((($A7-$A8)/($A6-$A8))*(AB6-AB8))","v":0},{"$f":"AC8+((($A7-$A8)/($A6-$A8))*(AC6-AC8))","v":0.67999999999999994},0.67999999999999994,{"$f":"AE8+((($A7-$A8)/($A6-$A8))*(AE6-AE8))","v":0.58000000000000007},0.64000000000000012,{"$f":"AG8+((($A7-$A8)/($A6-$A8))*(AG6-AG8))","v":0.52},0.64000000000000012,{"$f":"AI8+((($A7-$A8)/($A6-$A8))*(AI6-AI8))","v":0.45999999999999996},0.54117647058823526,{"$f":"AK8+((($A7-$A8)/($A6-$A8))*(AK6-AK8))","v":0}]
[1,1.51,1.51,1.07,1.3000000000000003,0.84,1.1400000000000001,0.69,0.81176470588235294,0,1.1399999999999999,1.1399999999999999,0.88,1.04,0.72,0.94,0.61,0.71764705882352942,0,0.78,0.78,0.65,0.74,0.56000000000000005,0.70000000000000018,0.49,0.57647058823529407,0,0.59,0.59,0.51,0.56000000000000005,0.46,0.56000000000000005,0.41,0.48235294117647054,0]
[{"$f":"IF((AND(A8<$B$40,A10>$B$40)),$B$40,\"0,0\")","v":"0,0"},{"$f":"B10+((($A9-$A10)/($A8-$A10))*(B8-B10))","v":1.93},1.93,{"$f":"D10+((($A9-$A10)/($A8-$A10))*(D8-D10))","v":1.3200000000000003},1.6300000000000008,{"$f":"F10+((($A9-$A10)/($A8-$A10))*(F8-F10))","v":1.0099999999999998},1.4099999999999995,{"$f":"H10+((($A9-$A10)/($A8-$A10))*(H8-H10))","v":0.80999999999999994},0.95294117647058818,{"$f":"J10+((($A9-$A10)/($A8-$A10))*(J8-J10))","v":0},{"$f":"K10+((($A9-$A10)/($A8-$A10))*(K8-K10))","v":1.4099999999999997},1.4099999999999997,{"$f":"M10+((($A9-$A10)/($A8-$A10))*(M8-M10))","v":1.06},1.27,{"$f":"O10+((($A9-$A10)/($A8-$A10))*(O8-O10))","v":0.85},1.1299999999999999,{"$f":"Q10+((($A9-$A10)/($A8-$A10))*(Q8-Q10))","v":0.71},0.83529411764705874,{"$f":"S10+((($A9-$A10)/($A8-$A10))*(S8-S10))","v":0},{"$f":"T10+((($A9-$A10)/($A8-$A10))*(T8-T10))","v":0.93},0.93,{"$f":"V10+((($A9-$A10)/($A8-$A10))*(V8-V10))","v":0.76},0.86999999999999988,{"$f":"X10+((($A9-$A10)/($A8-$A10))*(X8-X10))","v":0.65000000000000013},0.83000000000000029,{"$f":"Z10+((($A9-$A10)/($A8-$A10))*(Z8-Z10))","v":0.56000000000000005},0.65882352941176481,{"$f":"AB10+((($A9-$A10)/($A8-$A10))*(AB8-AB10))","v":0},{"$f":"AC10+((($A9-$A10)/($A8-$A10))*(AC8-AC10))","v":0.67999999999999994},0.67999999999999994,{"$f":"AE10+((($A9-$A10)/($A8-$A10))*(AE8-AE10))","v":0.58000000000000007},0.64000000000000012,{"$f":"AG10+((($A9-$A10)/($A8-$A10))*(AG8-AG10))","v":0.52},0.64000000000000012,{"$f":"AI10+((($A9-$A10)/($A8-$A10))*(AI8-AI10))","v":0.45999999999999996},0.54117647058823526,{"$f":"AK10+((($A9-$A10)/($A8-$A10))*(AK8-AK10))","v":0}]
[2,1.0900000000000001,1.0900000000000001,0.82,0.96999999999999986,0.67,0.87000000000000022,0.56999999999999995,0.6705882352941176,0,0.87,0.87,0.7,0.80999999999999994,0.59,0.74999999999999989,0.51,0.6,0,0.63,0.63,0.54,0.6100000000000001,0.47,0.56999999999999995,0.42,0.49411764705882355,0,0.5,0.5,0.44,0.48,0.4,0.48000000000000009,0.36,0.42352941176470588,0]
[{"$f":"IF((AND(A10<$B$40,A12>$B$40)),$B$40,\"0,0\")","v":"0,0"},{"$f":"B12+((($A11-$A12)/($A10-$A12))*(B10-B12))","v":1.5300000000000002},1.5300000000000002,{"$f":"D12+((($A11-$A12)/($A10-$A12))*(D10-D12))","v":1.0999999999999996},1.3299999999999992,{"$f":"F12+((($A11-$A12)/($A10-$A12))*(F10-F12))","v":0.87000000000000022},1.1500000000000008,{"$f":"H12+((($A11-$A12)/($A10-$A12))*(H10-H12))","v":0.72999999999999987},0.85882352941176454,{"$f":"J12+((($A11-$A12)/($A10-$A12))*(J10-J12))","v":0},{"$f":"K12+((($A11-$A12)/($A10-$A12))*(K10-K12))","v":1.19},1.19,{"$f":"M12+((($A11-$A12)/($A10-$A12))*(M10-M12))","v":0.91999999999999993},1.0699999999999998,{"$f":"O12+((($A11-$A12)/($A10-$A12))*(O10-O12))","v":0.76999999999999991},1.0099999999999998,{"$f":"Q12+((($A11-$A12)/($A10-$A12))*(Q10-Q12))","v":0.65},0.76470588235294124,{"$f":"S12+((($A11-$A12)/($A10-$A12))*(S10-S12))","v":0},{"$f":"T12+((($A11-$A12)/($A10-$A12))*(T10-T12))","v":0.83},0.83,{"$f":"V12+((($A11-$A12)/($A10-$A12))*(V10-V12))","v":0.68000000000000016},0.77000000000000035,{"$f":"X12+((($A11-$A12)/($A10-$A12))*(X10-X12))","v":0.59},0.72999999999999987,{"$f":"Z12+((($A11-$A12)/($A10-$A12))*(Z10-Z12))","v":0.52},0.61176470588235299,{"$f":"AB12+((($A11-$A12)/($A10-$A12))*(AB10-AB12))","v":0},{"$f":"AC12+((($A11-$A12)/($A10-$A12))*(AC10-AC12))","v":0.64},0.64,{"$f":"AE12+((($A11-$A12)/($A10-$A12))*(AE10-AE12))","v":0.54},0.57999999999999996,{"$f":"AG12+((($A11-$A12)/($A10-$A12))*(AG10-AG12))","v":0.50000000000000011},0.62000000000000044,{"$f":"AI12+((($A11-$A12)/($A10-$A12))*(AI10-AI12))","v":0.43999999999999995},0.51764705882352935,{"$f":"AK12+((($A11-$A12)/($A10-$A12))*(AK10-AK12))","v":0}]
[3,0.87,0.87,0.68,0.79000000000000015,0.56999999999999995,0.72999999999999987,0.49,0.57647058823529407,0,0.71,0.71,0.59,0.67999999999999994,0.5,0.62,0.44,0.51764705882352946,0,0.53,0.53,0.47,0.53,0.41,0.48999999999999994,0.37,0.43529411764705883,0,0.43,0.43,0.39,0.43000000000000005,0.35,0.40999999999999992,0.32,0.37647058823529411,0]
[{"$f":"IF((AND(A12<$B$40,A14>$B$40)),$B$40,\"0,0\")","v":"0,0"},{"$f":"B14+((($A13-$A14)/($A12-$A14))*(B12-B14))","v":1.26},1.26,{"$f":"D14+((($A13-$A14)/($A12-$A14))*(D12-D14))","v":0.95000000000000029},1.0900000000000007,{"$f":"F14+((($A13-$A14)/($A12-$A14))*(F12-F14))","v":0.80999999999999983},1.0899999999999996,{"$f":"H14+((($A13-$A14)/($A12-$A14))*(H12-H14))","v":0.66999999999999993},0.78823529411764692,{"$f":"J14+((($A13-$A14)/($A12-$A14))*(J12-J14))","v":0},{"$f":"K14+((($A13-$A14)/($A12-$A14))*(K12-K14))","v":1.0099999999999998},1.0099999999999998,{"$f":"M14+((($A13-$A14)/($A12-$A14))*(M12-M14))","v":0.82999999999999985},0.97999999999999976,{"$f":"O14+((($A13-$A14)/($A12-$A14))*(O12-O14))","v":0.67999999999999994},0.85999999999999988,{"$f":"Q14+((($A13-$A14)/($A12-$A14))*(Q12-Q14))","v":0.59},0.69411764705882351,{"$f":"S14+((($A13-$A14)/($A12-$A14))*(S12-S14))","v":0},{"$f":"T14+((($A13-$A14)/($A12-$A14))*(T12-T14))","v":0.71000000000000019},0.71000000000000019,{"$f":"V14+((($A13-$A14)/($A12-$A14))*(V12-V14))","v":0.64999999999999991},0.76999999999999991,{"$f":"X14+((($A13-$A14)/($A12-$A14))*(X12-X14))","v":0.52999999999999992},0.66999999999999993,{"$f":"Z14+((($A13-$A14)/($A12-$A14))*(Z12-Z14))","v":0.45999999999999991},0.54117647058823515,{"$f":"AB14+((($A13-$A14)/($A12-$A14))*(AB12-AB14))","v":0},{"$f":"AC14+((($A13-$A14)/($A12-$A14))*(AC12-AC14))","v":0.54999999999999993},0.54999999999999993,{"$f":"AE14+((($A13-$A14)/($A12-$A14))*(AE12-AE14))","v":0.51000000000000012},0.58000000000000029,{"$f":"AG14+((($A13-$A14)/($A12-$A14))*(AG12-AG14))","v":0.43999999999999989},0.4999999999999995,{"$f":"AI14+((($A13-$A14)/($A12-$A14))*(AI12-AI14))","v":0.41000000000000009},0.48235294117647071,{"$f":"AK14+((($A13-$A14)/($A12-$A14))*(AK12-AK14))","v":0}]
[4,0.74,0.74,0.59,0.69,0.49,0.61,0.43,0.50588235294117645,0,0.61,0.61,0.51,0.58000000000000007,0.44,0.54,0.39,0.45882352941176474,0,0.47,0.47,0.41,0.44999999999999996,0.37,0.42999999999999994,0.34,0.4,0,0.39,0.39,0.35,0.37999999999999995,0.32,0.38000000000000006,0.28999999999999998,0.3411764705882353,0]
[{"$f":"IF((AND(A14<$B$40,A16>$B$40)),$B$40,\"0,0\")","v":"0,0"},{"$f":"B16+((($A15-$A16)/($A14-$A16))*(B14-B16))","v":1.1399999999999999},1.1399999999999999,{"$f":"D16+((($A15-$A16)/($A14-$A16))*(D14-D16))","v":0.86999999999999977},1.0499999999999996,{"$f":"F16+((($A15-$A16)/($A14-$A16))*(F14-F16))","v":0.69},0.89000000000000012,{"$f":"H16+((($A15-$A16)/($A14-$A16))*(H14-H16))","v":0.58999999999999986},0.69411764705882339,{"$f":"J16+((($A15-$A16)/($A14-$A16))*(J14-J16))","v":0},{"$f":"K16+((($A15-$A16)/($A14-$A16))*(K14-K16))","v":0.88999999999999979},0.88999999999999979,{"$f":"M16+((($A15-$A16)/($A14-$A16))*(M14-M16))","v":0.75},0.90000000000000013,{"$f":"O16+((($A15-$A16)/($A14-$A16))*(O14-O16))","v":0.59999999999999987},0.77999999999999936,{"$f":"Q16+((($A15-$A16)/($A14-$A16))*(Q14-Q16))","v":0.51000000000000012},0.60000000000000009,{"$f":"S16+((($A15-$A16)/($A14-$A16))*(S14-S16))","v":0},{"$f":"T16+((($A15-$A16)/($A14-$A16))*(T14-T16))","v":0.66999999999999993},0.66999999999999993,{"$f":"V16+((($A15-$A16)/($A14-$A16))*(V14-V16))","v":0.56999999999999984},0.6499999999999998,{"$f":"X16+((($A15-$A16)/($A14-$A16))*(X14-X16))","v":0.48999999999999988},0.54999999999999938,{"$f":"Z16+((($A15-$A16)/($A14-$A16))*(Z14-Z16))","v":0.46000000000000013},0.54117647058823548,{"$f":"AB16+((($A15-$A16)/($A14-$A16))*(AB14-AB16))","v":0},{"$f":"AC16+((($A15-$A16)/($A14-$A16))*(AC14-AC16))","v":0.55000000000000016},0.55000000000000016,{"$f":"AE16+((($A15-$A16)/($A14-$A16))*(AE14-AE16))","v":0.46999999999999986},0.49999999999999961,{"$f":"AG16+((($A15-$A16)/($A14-$A16))*(AG14-AG16))","v":0.44000000000000011},0.58000000000000074,{"$f":"AI16+((($A15-$A16)/($A14-$A16))*(AI14-AI16))","v":0.36999999999999983},0.43529411764705861,{"$f":"AK16+((($A15-$A16)/($A14-$A16))*(AK14-AK16))","v":0}]
[5,0.64,0.64,0.52,0.60000000000000009,0.44,0.54,0.39,0.45882352941176474,0,0.54,0.54,0.45,0.5,0.4,0.48000000000000009,0.36,0.42352941176470588,0,0.42,0.42,0.37,0.39999999999999997,0.34,0.40000000000000008,0.31,0.36470588235294116,0,0.35,0.35,0.32,0.35000000000000003,0.28999999999999998,0.3299999999999999,0.27,0.31764705882352945,0]
[{"$f":"IF((AND(A16<$B$40,A18>$B$40)),$B$40,\"0,0\")","v":"0,0"},{"$f":"B18+((($A17-$A18)/($A16-$A18))*(B16-B18))","v":0.99000000000000032},0.99000000000000032,{"$f":"D18+((($A17-$A18)/($A16-$A18))*(D16-D18))","v":0.82000000000000006},1.0000000000000002,{"$f":"F18+((($A17-$A18)/($A16-$A18))*(F16-F18))","v":0.6399999999999999},0.73999999999999932,{"$f":"H18+((($A17-$A18)/($A16-$A18))*(H16-H18))","v":0.59000000000000019},0.69411764705882373,{"$f":"J18+((($A17-$A18)/($A16-$A18))*(J16-J18))","v":0},{"$f":"K18+((($A17-$A18)/($A16-$A18))*(K16-K18))","v":0.8400000000000003},0.8400000000000003,{"$f":"M18+((($A17-$A18)/($A16-$A18))*(M16-M18))","v":0.65000000000000013},0.70000000000000007,{"$f":"O18+((($A17-$A18)/($A16-$A18))*(O16-O18))","v":0.6000000000000002},0.78000000000000103,{"$f":"Q18+((($A17-$A18)/($A16-$A18))*(Q16-Q18))","v":0.50999999999999979},0.59999999999999976,{"$f":"S18+((($A17-$A18)/($A16-$A18))*(S16-S18))","v":0},{"$f":"T18+((($A17-$A18)/($A16-$A18))*(T16-T18))","v":0.61999999999999988},0.61999999999999988,{"$f":"V18+((($A17-$A18)/($A16-$A18))*(V16-V18))","v":0.5199999999999998},0.54999999999999938,{"$f":"X18+((($A17-$A18)/($A16-$A18))*(X16-X18))","v":0.49000000000000016},0.55000000000000071,{"$f":"Z18+((($A17-$A18)/($A16-$A18))*(Z16-Z18))","v":0.45999999999999985},0.54117647058823515,{"$f":"AB18+((($A17-$A18)/($A16-$A18))*(AB16-AB18))","v":0},{"$f":"AC18+((($A17-$A18)/($A16-$A18))*(AC16-AC18))","v":0.49999999999999983},0.49999999999999983,{"$f":"AE18+((($A17-$A18)/($A16-$A18))*(AE16-AE18))","v":0.47000000000000014},0.55000000000000049,{"$f":"AG18+((($A17-$A18)/($A16-$A18))*(AG16-AG18))","v":0.38999999999999979},0.42999999999999916,{"$f":"AI18+((($A17-$A18)/($A16-$A18))*(AI16-AI18))","v":0.37000000000000011},0.43529411764705894,{"$f":"AK18+((($A17-$A18)/($A16-$A18))*(AK16-AK18))","v":0}]
[6,0.56999999999999995,0.56999999999999995,0.46,0.52,0.4,0.50000000000000011,0.35,0.41176470588235292,0,0.48,0.48,0.41,0.45999999999999996,0.36,0.41999999999999993,0.33,0.38823529411764707,0,0.38,0.38,0.34,0.37000000000000005,0.31,0.36999999999999994,0.28000000000000003,0.3294117647058824,0,0.32,0.32,0.28999999999999998,0.30999999999999994,0.27,0.31000000000000005,0.25,0.29411764705882354,0]
[{"$f":"IF((AND(A18<$B$40,A20>$B$40)),$B$40,\"0,0\")","v":"0,0"},{"$f":"B20+((($A19-$A20)/($A18-$A20))*(B18-B20))","v":0.86999999999999955},0.86999999999999955,{"$f":"D20+((($A19-$A20)/($A18-$A20))*(D18-D20))","v":0.70000000000000018},0.82000000000000017,{"$f":"F20+((($A19-$A20)/($A18-$A20))*(F18-F20))","v":0.58000000000000018},0.80000000000000104,{"$f":"H20+((($A19-$A20)/($A18-$A20))*(H18-H20))","v":0.46999999999999975},0.55294117647058794,{"$f":"J20+((($A19-$A20)/($A18-$A20))*(J18-J20))","v":0},{"$f":"K20+((($A19-$A20)/($A18-$A20))*(K18-K20))","v":0.71999999999999986},0.71999999999999986,{"$f":"M20+((($A19-$A20)/($A18-$A20))*(M18-M20))","v":0.58999999999999986},0.6399999999999999,{"$f":"O20+((($A19-$A20)/($A18-$A20))*(O18-O20))","v":0.53999999999999981},0.59999999999999898,{"$f":"Q20+((($A19-$A20)/($A18-$A20))*(Q18-Q20))","v":0.51000000000000023},0.60000000000000031,{"$f":"S20+((($A19-$A20)/($A18-$A20))*(S18-S20))","v":0},{"$f":"T20+((($A19-$A20)/($A18-$A20))*(T18-T20))","v":0.56000000000000016},0.56000000000000016,{"$f":"V20+((($A19-$A20)/($A18-$A20))*(V18-V20))","v":0.52000000000000024},0.61000000000000032,{"$f":"X20+((($A19-$A20)/($A18-$A20))*(X18-X20))","v":0.4300000000000001},0.49000000000000005,{"$f":"Z20+((($A19-$A20)/($A18-$A20))*(Z18-Z20))","v":0.40000000000000013},0.47058823529411781,{"$f":"AB20+((($A19-$A20)/($A18-$A20))*(AB18-AB20))","v":0},{"$f":"AC20+((($A19-$A20)/($A18-$A20))*(AC18-AC20))","v":0.44000000000000011},0.44000000000000011,{"$f":"AE20+((($A19-$A20)/($A18-$A20))*(AE18-AE20))","v":0.40999999999999975},0.42999999999999938,{"$f":"AG20+((($A19-$A20)/($A18-$A20))*(AG18-AG20))","v":0.39000000000000012},0.55000000000000027,{"$f":"AI20+((($A19-$A20)/($A18-$A20))*(AI18-AI20))","v":0.31000000000000005},0.36470588235294121,{"$f":"AK20+((($A19-$A20)/($A18-$A20))*(AK18-AK20))","v":0}]
[7,0.52,0.52,0.42,0.47,0.37,0.44999999999999996,0.33,0.38823529411764707,0,0.44,0.44,0.38,0.43,0.33,0.39000000000000007,0.3,0.3529411764705882,0,0.35,0.35,0.31,0.33,0.28999999999999998,0.34999999999999992,0.26,0.30588235294117649,0,0.3,0.3,0.27,0.29000000000000004,0.25,0.27,0.24,0.28235294117647058,0]
[{"$f":"IF((AND(A20<$B$40,A22>$B$40)),$B$40,\"0,0\")","v":"0,0"},{"$f":"B22+((($A21-$A22)/($A20-$A22))*(B20-B22))","v":0.87000000000000033},0.87000000000000033,{"$f":"D22+((($A21-$A22)/($A20-$A22))*(D20-D22))","v":0.62999999999999978},0.67999999999999972,{"$f":"F22+((($A21-$A22)/($A20-$A22))*(F20-F22))","v":0.57999999999999985},0.65999999999999903,{"$f":"H22+((($A21-$A22)/($A20-$A22))*(H20-H22))","v":0.54000000000000026},0.63529411764705912,{"$f":"J22+((($A21-$A22)/($A20-$A22))*(J20-J22))","v":0},{"$f":"K22+((($A21-$A22)/($A20-$A22))*(K20-K22))","v":0.71999999999999986},0.71999999999999986,{"$f":"M22+((($A21-$A22)/($A20-$A22))*(M20-M22))","v":0.59000000000000019},0.71000000000000019,{"$f":"O22+((($A21-$A22)/($A20-$A22))*(O20-O22))","v":0.47000000000000014},0.53000000000000091,{"$f":"Q22+((($A21-$A22)/($A20-$A22))*(Q20-Q22))","v":0.43999999999999972},0.51764705882352913,{"$f":"S22+((($A21-$A22)/($A20-$A22))*(S20-S22))","v":0},{"$f":"T22+((($A21-$A22)/($A20-$A22))*(T20-T22))","v":0.48999999999999971},0.48999999999999971,{"$f":"V22+((($A21-$A22)/($A20-$A22))*(V20-V22))","v":0.45000000000000012},0.47000000000000053,{"$f":"X22+((($A21-$A22)/($A20-$A22))*(X20-X22))","v":0.42999999999999972},0.62999999999999901,{"$f":"Z22+((($A21-$A22)/($A20-$A22))*(Z20-Z22))","v":0.33000000000000007},0.38823529411764712,{"$f":"AB22+((($A21-$A22)/($A20-$A22))*(AB20-AB22))","v":0},{"$f":"AC22+((($A21-$A22)/($A20-$A22))*(AC20-AC22))","v":0.43999999999999972},0.43999999999999972,{"$f":"AE22+((($A21-$A22)/($A20-$A22))*(AE20-AE22))","v":0.34000000000000008},0.3600000000000001,{"$f":"AG22+((($A21-$A22)/($A20-$A22))*(AG20-AG22))","v":0.32000000000000006},0.2000000000000004,{"$f":"AI22+((($A21-$A22)/($A20-$A22))*(AI20-AI22))","v":0.37999999999999989},0.44705882352941162,{"$f":"AK22+((($A21-$A22)/($A20-$A22))*(AK20-AK22))","v":0}]
[8,0.47,0.47,0.39,0.44,0.34,0.4200000000000001,0.3,0.3529411764705882,0,0.4,0.4,0.35,0.38999999999999996,0.31,0.36999999999999994,0.28000000000000003,0.3294117647058824,0,0.33,0.33,0.28999999999999998,0.30999999999999994,0.27,0.31000000000000005,0.25,0.29411764705882354,0,0.28000000000000003,0.28000000000000003,0.26,0.28000000000000003,0.24,0.27999999999999997,0.22,0.25882352941176473,0]
[{"$f":"IF((AND(A22<$B$40,A24>$B$40)),$B$40,\"0,0\")","v":"0,0"},{"$f":"B24+((($A23-$A24)/($A22-$A24))*(B22-B24))","v":0.78999999999999981},0.78999999999999981,{"$f":"D24+((($A23-$A24)/($A22-$A24))*(D22-D24))","v":0.63000000000000023},0.76000000000000023,{"$f":"F24+((($A23-$A24)/($A22-$A24))*(F22-F24))","v":0.50000000000000022},0.58000000000000129,{"$f":"H24+((($A23-$A24)/($A22-$A24))*(H22-H24))","v":0.45999999999999969},0.54117647058823493,{"$f":"J24+((($A23-$A24)/($A22-$A24))*(J22-J24))","v":0},{"$f":"K24+((($A23-$A24)/($A22-$A24))*(K22-K24))","v":0.64000000000000024},0.64000000000000024,{"$f":"M24+((($A23-$A24)/($A22-$A24))*(M22-M24))","v":0.58999999999999975},0.7099999999999993,{"$f":"O24+((($A23-$A24)/($A22-$A24))*(O22-O24))","v":0.47000000000000014},0.53,{"$f":"Q24+((($A23-$A24)/($A22-$A24))*(Q22-Q24))","v":0.44000000000000017},0.51764705882352957,{"$f":"S24+((($A23-$A24)/($A22-$A24))*(S22-S24))","v":0},{"$f":"T24+((($A23-$A24)/($A22-$A24))*(T22-T24))","v":0.57000000000000028},0.57000000000000028,{"$f":"V24+((($A23-$A24)/($A22-$A24))*(V22-V24))","v":0.44999999999999968},0.4699999999999992,{"$f":"X24+((($A23-$A24)/($A22-$A24))*(X22-X24))","v":0.43000000000000016},0.47000000000000064,{"$f":"Z24+((($A23-$A24)/($A22-$A24))*(Z22-Z24))","v":0.40999999999999992},0.48235294117647048,{"$f":"AB24+((($A23-$A24)/($A22-$A24))*(AB22-AB24))","v":0},{"$f":"AC24+((($A23-$A24)/($A22-$A24))*(AC22-AC24))","v":0.44000000000000017},0.44000000000000017,{"$f":"AE24+((($A23-$A24)/($A22-$A24))*(AE22-AE24))","v":0.42000000000000015},0.44000000000000039,{"$f":"AG24+((($A23-$A24)/($A22-$A24))*(AG22-AG24))","v":0.39999999999999991},0.59999999999999964,{"$f":"AI24+((($A23-$A24)/($A22-$A24))*(AI22-AI24))","v":0.30000000000000004},0.35294117647058831,{"$f":"AK24+((($A23-$A24)/($A22-$A24))*(AK22-AK24))","v":0}]
[9,0.43,0.43,0.36,0.39999999999999997,0.32,0.39999999999999997,0.28000000000000003,0.3294117647058824,0,0.37,0.37,0.32,0.35000000000000003,0.28999999999999998,0.34999999999999992,0.26,0.30588235294117649,0,0.3,0.3,0.27,0.29000000000000004,0.25,0.28999999999999998,0.23,0.27058823529411768,0,0.26,0.26,0.24,0.26,0.22,0.24000000000000002,0.21,0.24705882352941178,0]
[{"$f":"IF((AND(A24<$B$40,A26>$B$40)),$B$40,\"0,0\")","v":"0,0"},{"$f":"B26+((($A25-$A26)/($A24-$A26))*(B24-B26))","v":0.69999999999999973},0.69999999999999973,{"$f":"D26+((($A25-$A26)/($A24-$A26))*(D24-D26))","v":0.53999999999999959},0.57999999999999896,{"$f":"F26+((($A25-$A26)/($A24-$A26))*(F24-F26))","v":0.50000000000000022},0.76000000000000045,{"$f":"H26+((($A25-$A26)/($A24-$A26))*(H24-H26))","v":0.37000000000000011},0.43529411764705894,{"$f":"J26+((($A25-$A26)/($A24-$A26))*(J24-J26))","v":0},{"$f":"K26+((($A25-$A26)/($A24-$A26))*(K24-K26))","v":0.55000000000000016},0.55000000000000016,{"$f":"M26+((($A25-$A26)/($A24-$A26))*(M24-M26))","v":0.50000000000000022},0.5300000000000008,{"$f":"O26+((($A25-$A26)/($A24-$A26))*(O24-O26))","v":0.46999999999999964},0.70999999999999874,{"$f":"Q26+((($A25-$A26)/($A24-$A26))*(Q24-Q26))","v":0.35000000000000009},0.41176470588235303,{"$f":"S26+((($A25-$A26)/($A24-$A26))*(S24-S26))","v":0},{"$f":"T26+((($A25-$A26)/($A24-$A26))*(T24-T26))","v":0.39000000000000007},0.39000000000000007,{"$f":"V26+((($A25-$A26)/($A24-$A26))*(V24-V26))","v":0.3600000000000001},0.38000000000000012,{"$f":"X26+((($A25-$A26)/($A24-$A26))*(X24-X26))","v":0.34000000000000008},0.38000000000000012,{"$f":"Z26+((($A25-$A26)/($A24-$A26))*(Z24-Z26))","v":0.32000000000000006},0.37647058823529422,{"$f":"AB26+((($A25-$A26)/($A24-$A26))*(AB24-AB26))","v":0},{"$f":"AC26+((($A25-$A26)/($A24-$A26))*(AC24-AC26))","v":0.35000000000000009},0.35000000000000009,{"$f":"AE26+((($A25-$A26)/($A24-$A26))*(AE24-AE26))","v":0.32999999999999985},0.34999999999999964,{"$f":"AG26+((($A25-$A26)/($A24-$A26))*(AG24-AG26))","v":0.31000000000000005},0.33000000000000052,{"$f":"AI26+((($A25-$A26)/($A24-$A26))*(AI24-AI26))","v":0.29999999999999982},0.35294117647058804,{"$f":"AK26+((($A25-$A26)/($A24-$A26))*(AK24-AK26))","v":0}]
[10,0.4,0.4,0.34,0.38000000000000006,0.3,0.35999999999999993,0.27,0.31764705882352945,0,0.35,0.35,0.3,0.32999999999999996,0.27,0.31000000000000005,0.25,0.29411764705882354,0,0.28999999999999998,0.28999999999999998,0.26,0.28000000000000003,0.24,0.27999999999999997,0.22,0.25882352941176473,0,0.25,0.25,0.23,0.25,0.21,0.22999999999999995,0.2,0.23529411764705885,0]
[{"$f":"IF((AND(A26<$B$40,A28>$B$40)),$B$40,\"0,0\")","v":"0,0"},{"$f":"B28+((($A27-$A28)/($A26-$A28))*(B26-B28))","v":0.6000000000000002},0.6000000000000002,{"$f":"D28+((($A27-$A28)/($A26-$A28))*(D26-D28))","v":0.54000000000000026},0.63000000000000067,{"$f":"F28+((($A27-$A28)/($A26-$A28))*(F26-F28))","v":0.44999999999999984},0.50999999999999923,{"$f":"H28+((($A27-$A28)/($A26-$A28))*(H26-H28))","v":0.42000000000000015},0.49411764705882372,{"$f":"J28+((($A27-$A28)/($A26-$A28))*(J26-J28))","v":0},{"$f":"K28+((($A27-$A28)/($A26-$A28))*(K26-K28))","v":0.54999999999999982},0.54999999999999982,{"$f":"M28+((($A27-$A28)/($A26-$A28))*(M26-M28))","v":0.44999999999999984},0.47999999999999954,{"$f":"O28+((($A27-$A28)/($A26-$A28))*(O26-O28))","v":0.42000000000000015},0.46000000000000041,{"$f":"Q28+((($A27-$A28)/($A26-$A28))*(Q26-Q28))","v":0.4},0.4705882352941177,{"$f":"S28+((($A27-$A28)/($A26-$A28))*(S26-S28))","v":0},{"$f":"T28+((($A27-$A28)/($A26-$A28))*(T26-T28))","v":0.43999999999999984},0.43999999999999984,{"$f":"V28+((($A27-$A28)/($A26-$A28))*(V26-V28))","v":0.41000000000000003},0.43000000000000005,{"$f":"X28+((($A27-$A28)/($A26-$A28))*(X26-X28))","v":0.39},0.53000000000000014,{"$f":"Z28+((($A27-$A28)/($A26-$A28))*(Z26-Z28))","v":0.31999999999999995},0.37647058823529406,{"$f":"AB28+((($A27-$A28)/($A26-$A28))*(AB26-AB28))","v":0},{"$f":"AC28+((($A27-$A28)/($A26-$A28))*(AC26-AC28))","v":0.4},0.4,{"$f":"AE28+((($A27-$A28)/($A26-$A28))*(AE26-AE28))","v":0.33000000000000007},0.3500000000000002,{"$f":"AG28+((($A27-$A28)/($A26-$A28))*(AG26-AG28))","v":0.30999999999999994},0.32999999999999963,{"$f":"AI28+((($A27-$A28)/($A26-$A28))*(AI26-AI28))","v":0.3000000000000001},0.35294117647058837,{"$f":"AK28+((($A27-$A28)/($A26-$A28))*(AK26-AK28))","v":0}]
[12,0.36,0.36,0.3,0.32999999999999996,0.27,0.33000000000000007,0.24,0.28235294117647058,0,0.31,0.31,0.27,0.30000000000000004,0.24,0.27999999999999997,0.22,0.25882352941176473,0,0.26,0.26,0.23,0.25,0.21,0.22999999999999995,0.2,0.23529411764705885,0,0.22,0.22,0.21,0.22999999999999998,0.19,0.21000000000000002,0.18,0.21176470588235294,0]
[{"$f":"IF((AND(A28<$B$40,A30>$B$40)),$B$40,\"0,0\")","v":"0,0"},{"$f":"B30+((($A29-$A30)/($A28-$A30))*(B28-B30))","v":0.59999999999999987},0.59999999999999987,{"$f":"D30+((($A29-$A30)/($A28-$A30))*(D28-D30))","v":0.47999999999999982},0.50999999999999945,{"$f":"F30+((($A29-$A30)/($A28-$A30))*(F28-F30))","v":0.45000000000000018},0.63000000000000067,{"$f":"H30+((($A29-$A30)/($A28-$A30))*(H28-H30))","v":0.35999999999999993},0.42352941176470582,{"$f":"J30+((($A29-$A30)/($A28-$A30))*(J28-J30))","v":0},{"$f":"K30+((($A29-$A30)/($A28-$A30))*(K28-K30))","v":0.48999999999999982},0.48999999999999982,{"$f":"M30+((($A29-$A30)/($A28-$A30))*(M28-M30))","v":0.39000000000000012},0.42000000000000032,{"$f":"O30+((($A29-$A30)/($A28-$A30))*(O28-O30))","v":0.35999999999999993},0.39999999999999986,{"$f":"Q30+((($A29-$A30)/($A28-$A30))*(Q28-Q30))","v":0.33999999999999997},0.39999999999999997,{"$f":"S30+((($A29-$A30)/($A28-$A30))*(S28-S30))","v":0},{"$f":"T30+((($A29-$A30)/($A28-$A30))*(T28-T30))","v":0.44},0.44,{"$f":"V30+((($A29-$A30)/($A28-$A30))*(V28-V30))","v":0.35000000000000009},0.43000000000000027,{"$f":"X30+((($A29-$A30)/($A28-$A30))*(X28-X30))","v":0.26999999999999991},0.16999999999999948,{"$f":"Z30+((($A29-$A30)/($A28-$A30))*(Z28-Z30))","v":0.32000000000000012},0.37647058823529428,{"$f":"AB30+((($A29-$A30)/($A28-$A30))*(AB28-AB30))","v":0},{"$f":"AC30+((($A29-$A30)/($A28-$A30))*(AC28-AC30))","v":0.33999999999999997},0.33999999999999997,{"$f":"AE30+((($A29-$A30)/($A28-$A30))*(AE28-AE30))","v":0.32999999999999996},0.40999999999999986,{"$f":"AG30+((($A29-$A30)/($A28-$A30))*(AG28-AG30))","v":0.25000000000000006},0.27000000000000041,{"$f":"AI30+((($A29-$A30)/($A28-$A30))*(AI28-AI30))","v":0.23999999999999988},0.28235294117647047,{"$f":"AK30+((($A29-$A30)/($A28-$A30))*(AK28-AK30))","v":0}]
[14,0.32,0.32,0.27,0.30000000000000004,0.24,0.27999999999999997,0.22,0.25882352941176473,0,0.28000000000000003,0.28000000000000003,0.25,0.28000000000000003,0.22,0.26,0.2,0.23529411764705885,0,0.23,0.23,0.21,0.21999999999999997,0.2,0.24000000000000005,0.18,0.21176470588235294,0,0.2,0.2,0.19,0.2,0.18,0.19999999999999996,0.17,0.2,0]
[{"$f":"IF((AND(A30<$B$40,A32>$B$40)),$B$40,\"0,0\")","v":"0,0"},{"$f":"B32+((($A31-$A32)/($A30-$A32))*(B30-B32))","v":0.53000000000000025},0.53000000000000025,{"$f":"D32+((($A31-$A32)/($A30-$A32))*(D30-D32))","v":0.41000000000000014},0.44000000000000039,{"$f":"F32+((($A31-$A32)/($A30-$A32))*(F30-F32))","v":0.37999999999999989},0.41999999999999982,{"$f":"H32+((($A31-$A32)/($A30-$A32))*(H30-H32))","v":0.35999999999999993},0.42352941176470582,{"$f":"J32+((($A31-$A32)/($A30-$A32))*(J30-J32))","v":0},{"$f":"K32+((($A31-$A32)/($A30-$A32))*(K30-K32))","v":0.49000000000000021},0.49000000000000021,{"$f":"M32+((($A31-$A32)/($A30-$A32))*(M30-M32))","v":0.3899999999999999},0.41999999999999987,{"$f":"O32+((($A31-$A32)/($A30-$A32))*(O30-O32))","v":0.35999999999999993},0.53999999999999959,{"$f":"Q32+((($A31-$A32)/($A30-$A32))*(Q30-Q32))","v":0.27000000000000007},0.3176470588235295,{"$f":"S32+((($A31-$A32)/($A30-$A32))*(S30-S32))","v":0},{"$f":"T32+((($A31-$A32)/($A30-$A32))*(T30-T32))","v":0.37000000000000011},0.37000000000000011,{"$f":"V32+((($A31-$A32)/($A30-$A32))*(V30-V32))","v":0.27999999999999986},0.21999999999999958,{"$f":"X32+((($A31-$A32)/($A30-$A32))*(X30-X32))","v":0.34000000000000014},0.52000000000000068,{"$f":"Z32+((($A31-$A32)/($A30-$A32))*(Z30-Z32))","v":0.24999999999999986},0.29411764705882337,{"$f":"AB32+((($A31-$A32)/($A30-$A32))*(AB30-AB32))","v":0},{"$f":"AC32+((($A31-$A32)/($A30-$A32))*(AC30-AC32))","v":0.27000000000000007},0.27000000000000007,{"$f":"AE32+((($A31-$A32)/($A30-$A32))*(AE30-AE32))","v":0.32999999999999996},0.33999999999999997,{"$f":"AG32+((($A31-$A32)/($A30-$A32))*(AG30-AG32))","v":0.31999999999999995},0.4799999999999997,{"$f":"AI32+((($A31-$A32)/($A30-$A32))*(AI30-AI32))","v":0.24000000000000007},0.2823529411764707,{"$f":"AK32+((($A31-$A32)/($A30-$A32))*(AK30-AK32))","v":0}]
[16,0.28999999999999998,0.28999999999999998,0.25,0.28000000000000003,0.22,0.26,0.2,0.23529411764705885,0,0.25,0.25,0.23,0.26,0.2,0.22000000000000003,0.19,0.22352941176470589,0,0.21,0.21,0.2,0.22000000000000003,0.18,0.19999999999999996,0.17,0.2,0,0.19,0.19,0.17,0.18000000000000002,0.16,0.16,0.16,0.18823529411764706,0]
[{"$f":"IF((AND(A32<$B$40,A34>$B$40)),$B$40,\"0,0\")","v":"0,0"},{"$f":"B34+((($A33-$A34)/($A32-$A34))*(B32-B34))","v":0.5299999999999998},0.5299999999999998,{"$f":"D34+((($A33-$A34)/($A32-$A34))*(D32-D34))","v":0.40999999999999992},0.43999999999999995,{"$f":"F34+((($A33-$A34)/($A32-$A34))*(F32-F34))","v":0.37999999999999989},0.57999999999999952,{"$f":"H34+((($A33-$A34)/($A32-$A34))*(H32-H34))","v":0.28000000000000008},0.32941176470588246,{"$f":"J34+((($A33-$A34)/($A32-$A34))*(J32-J34))","v":0},{"$f":"K34+((($A33-$A34)/($A32-$A34))*(K32-K34))","v":0.40999999999999992},0.40999999999999992,{"$f":"M34+((($A33-$A34)/($A32-$A34))*(M32-M34))","v":0.39000000000000012},0.50000000000000022,{"$f":"O34+((($A33-$A34)/($A32-$A34))*(O32-O34))","v":0.28000000000000008},0.3000000000000001,{"$f":"Q34+((($A33-$A34)/($A32-$A34))*(Q32-Q34))","v":0.27000000000000007},0.3176470588235295,{"$f":"S34+((($A33-$A34)/($A32-$A34))*(S32-S34))","v":0},{"$f":"T34+((($A33-$A34)/($A32-$A34))*(T32-T34))","v":0.28999999999999981},0.28999999999999981,{"$f":"V34+((($A33-$A34)/($A32-$A34))*(V32-V34))","v":0.36000000000000015},0.46000000000000046,{"$f":"X34+((($A33-$A34)/($A32-$A34))*(X32-X34))","v":0.25999999999999984},0.27999999999999931,{"$f":"Z34+((($A33-$A34)/($A32-$A34))*(Z32-Z34))","v":0.25000000000000011},0.29411764705882365,{"$f":"AB34+((($A33-$A34)/($A32-$A34))*(AB32-AB34))","v":0},{"$f":"AC34+((($A33-$A34)/($A32-$A34))*(AC32-AC34))","v":0.34999999999999992},0.34999999999999992,{"$f":"AE34+((($A33-$A34)/($A32-$A34))*(AE32-AE34))","v":0.25000000000000011},0.26000000000000012,{"$f":"AG34+((($A33-$A34)/($A32-$A34))*(AG32-AG34))","v":0.24000000000000007},0.24000000000000007,{"$f":"AI34+((($A33-$A34)/($A32-$A34))*(AI32-AI34))","v":0.24000000000000007},0.2823529411764707,{"$f":"AK34+((($A33-$A34)/($A32-$A34))*(AK32-AK34))","v":0}]
[18,0.26,0.26,0.23,0.26,0.2,0.22000000000000003,0.19,0.22352941176470589,0,0.23,0.23,0.21,0.22999999999999998,0.19,0.21000000000000002,0.18,0.21176470588235294,0,0.2,0.2,0.18,0.18999999999999997,0.17,0.19000000000000003,0.16,0.18823529411764706,0,0.17,0.17,0.16,0.17,0.15,0.15,0.15,0.1764705882352941,0]
[{"$f":"IF((AND(A34<$B$40,A36>$B$40)),$B$40,\"0,0\")","v":"0,0"},{"$f":"B36+((($A35-$A36)/($A34-$A36))*(B34-B36))","v":0.44000000000000017},0.44000000000000017,{"$f":"D36+((($A35-$A36)/($A34-$A36))*(D34-D36))","v":0.41000000000000014},0.53000000000000025,{"$f":"F36+((($A35-$A36)/($A34-$A36))*(F34-F36))","v":0.29000000000000009},0.1300000000000005,{"$f":"H36+((($A35-$A36)/($A34-$A36))*(H34-H36))","v":0.36999999999999988},0.43529411764705872,{"$f":"J36+((($A35-$A36)/($A34-$A36))*(J34-J36))","v":0},{"$f":"K36+((($A35-$A36)/($A34-$A36))*(K34-K36))","v":0.32000000000000006},0.32000000000000006,{"$f":"M36+((($A35-$A36)/($A34-$A36))*(M34-M36))","v":0.3899999999999999},0.49999999999999972,{"$f":"O36+((($A35-$A36)/($A34-$A36))*(O34-O36))","v":0.28000000000000008},0.1200000000000005,{"$f":"Q36+((($A35-$A36)/($A34-$A36))*(Q34-Q36))","v":0.35999999999999988},0.42352941176470571,{"$f":"S36+((($A35-$A36)/($A34-$A36))*(S34-S36))","v":0},{"$f":"T36+((($A35-$A36)/($A34-$A36))*(T34-T36))","v":0.38000000000000017},0.38000000000000017,{"$f":"V36+((($A35-$A36)/($A34-$A36))*(V34-V36))","v":0.2699999999999998},0.27999999999999947,{"$f":"X36+((($A35-$A36)/($A34-$A36))*(X34-X36))","v":0.26000000000000012},0.28000000000000014,{"$f":"Z36+((($A35-$A36)/($A34-$A36))*(Z34-Z36))","v":0.25000000000000011},0.29411764705882365,{"$f":"AB36+((($A35-$A36)/($A34-$A36))*(AB34-AB36))","v":0},{"$f":"AC36+((($A35-$A36)/($A34-$A36))*(AC34-AC36))","v":0.26000000000000012},0.26000000000000012,{"$f":"AE36+((($A35-$A36)/($A34-$A36))*(AE34-AE36))","v":0.25000000000000011},0.2600000000000004,{"$f":"AG36+((($A35-$A36)/($A34-$A36))*(AG34-AG36))","v":0.23999999999999982},0.23999999999999982,{"$f":"AI36+((($A35-$A36)/($A34-$A36))*(AI34-AI36))","v":0.23999999999999982},0.28235294117647036,{"$f":"AK36+((($A35-$A36)/($A34-$A36))*(AK34-AK36))","v":0}]
[20,0.24,0.24,0.21,0.22999999999999998,0.19,0.22999999999999998,0.17,0.2,0,0.22,0.22,0.19,0.2,0.18,0.21999999999999997,0.16,0.18823529411764706,0,0.18,0.18,0.17,0.18000000000000002,0.16,0.18000000000000002,0.15,0.1764705882352941,0,0.16,0.16,0.15,0.15999999999999998,0.14000000000000001,0.14000000000000001,0.14000000000000001,0.1647058823529412,0]
[{"$f":"IF((AND(A36<$B$40,A38>$B$40)),$B$40,\"0,0\")","v":"0,0"},{"$f":"B38+((($A37-$A38)/($A36-$A38))*(B36-B38))","v":0.24},0.24,{"$f":"D38+((($A37-$A38)/($A36-$A38))*(D36-D38))","v":0.21},0.22999999999999998,{"$f":"F38+((($A37-$A38)/($A36-$A38))*(F36-F38))","v":0.19},0.22999999999999998,{"$f":"H38+((($A37-$A38)/($A36-$A38))*(H36-H38))","v":0.17},0.2,{"$f":"J38+((($A37-$A38)/($A36-$A38))*(J36-J38))","v":0},{"$f":"K38+((($A37-$A38)/($A36-$A38))*(K36-K38))","v":0.22},0.22,{"$f":"M38+((($A37-$A38)/($A36-$A38))*(M36-M38))","v":0.19},0.2,{"$f":"O38+((($A37-$A38)/($A36-$A38))*(O36-O38))","v":0.18},0.21999999999999997,{"$f":"Q38+((($A37-$A38)/($A36-$A38))*(Q36-Q38))","v":0.16},0.18823529411764706,{"$f":"S38+((($A37-$A38)/($A36-$A38))*(S36-S38))","v":0},{"$f":"T38+((($A37-$A38)/($A36-$A38))*(T36-T38))","v":0.18},0.18,{"$f":"V38+((($A37-$A38)/($A36-$A38))*(V36-V38))","v":0.17},0.18000000000000002,{"$f":"X38+((($A37-$A38)/($A36-$A38))*(X36-X38))","v":0.16},0.18000000000000002,{"$f":"Z38+((($A37-$A38)/($A36-$A38))*(Z36-Z38))","v":0.15},0.1764705882352941,{"$f":"AB38+((($A37-$A38)/($A36-$A38))*(AB36-AB38))","v":0},{"$f":"AC38+((($A37-$A38)/($A36-$A38))*(AC36-AC38))","v":0.16},0.16,{"$f":"AE38+((($A37-$A38)/($A36-$A38))*(AE36-AE38))","v":0.15},0.15999999999999998,{"$f":"AG38+((($A37-$A38)/($A36-$A38))*(AG36-AG38))","v":0.14000000000000001},0.14000000000000001,{"$f":"AI38+((($A37-$A38)/($A36-$A38))*(AI36-AI38))","v":0.14000000000000001},0.1647058823529412,{"$f":"AK38+((($A37-$A38)/($A36-$A38))*(AK36-AK38))","v":0}]
[1000,{"$f":"B36","v":0.24},0.24,{"$f":"D36","v":0.21},0.22999999999999998,0.19,0.22999999999999998,0.17,0.2,0,0.22,0.22,0.19,0.2,0.18,0.21999999999999997,0.16,0.18823529411764706,0,0.18,0.18,0.17,0.18000000000000002,0.16,0.18000000000000002,0.15,0.1764705882352941,0,0.16,0.16,0.15,0.15999999999999998,0.14000000000000001,0.14000000000000001,0.14000000000000001,0.1647058823529412,0]
[]
["B'",{"$f":"IF(Cerramiento!G3=\"ESTIMADOS\",Auxiliar!AF31,'Datos necesarios'!H24)","v":""},null,"Rf",{"$f":"'Recop. Datos'!A18","v":0},1,"Us (0,5-1,0)",{"$f":"IFERROR((INDEX(B6:J38,MATCH(B40,A6:A38,0),MATCH(E40,B5:J5,0))),0)","v":0}]
[null,null,null,null,null,2,"Us (1,0-2,0)",{"$f":"IFERROR((INDEX(K6:S38,MATCH(B40,A6:A38,0),MATCH(E40,K5:S5,0))),0)","v":0}]
[null,null,null,null,null,3,"Us (2,0-3,0)",{"$f":"IFERROR((INDEX(T6:AB38,MATCH(B40,A6:A38,0),MATCH(E40,T5:AB5,0))),0)","v":0}]
[null,null,null,null,null,4,"Us (>3,0)",{"$f":"IFERROR((INDEX(AC6:AK38,MATCH(B40,A6:A38,0),MATCH(E40,AC5:AK5,0))),0)","v":0}]

{"sheet":"Tabla4V","index":10,"n_rows":43,"n_cols":37,"rows_kept":43,"cut":false,"hidden":true,"merged":[[3,3,3,7],[3,12,3,16],[3,21,3,25],[3,30,3,34],[0,0,1,36],[2,3,2,7],[2,12,2,16],[2,21,2,25],[2,30,2,34]]}
["Tabla 4. TRANSMITANCIA TÉRMICA Us [W/m²K]"]
[]
[null,null,null,"0,5 m < z ≤ 1,0 m",null,null,null,null,null,null,null,null,"1,0 m < z ≤ 2,0 m",null,null,null,null,null,null,null,null,"2,0 m < z ≤ 3,0 m",null,null,null,null,null,null,null,null,"z > 3,0 m"]
[null,null,null,"Rf [m²\u0097K/ W]",null,null,null,null,null,null,null,null,"Rf [m²\u0097K/ W]",null,null,null,null,null,null,null,null,"Rf [m²\u0097K/ W]",null,null,null,null,null,null,null,null,"Rf [m²\u0097K/ W]"]
["B'",0,{"$f":"IF((AND(B5<$E$40,D5>$E$40)),$E$40,\"0,00\")","v":"0,00"},0.5,{"$f":"IF((AND(D5<$E$40,F5>$E$40)),$E$40,\"0,00\")","v":"0,00"},1,{"$f":"IF((AND(F5<$E$40,H5>$E$40)),$E$40,\"0,00\")","v":"0,00"},1.5,{"$f":"IF((AND(H5<$E$40,J5>$E$40)),$E$40,\"0,00\")","v":"0,00"},10,0,{"$f":"IF((AND(K5<$E$40,M5>$E$40)),$E$40,\"0,00\")","v":"0,00"},0.5,{"$f":"IF((AND(M5<$E$40,O5>$E$40)),$E$40,\"0,00\")","v":"0,00"},1,{"$f":"IF((AND(O5<$E$40,Q5>$E$40)),$E$40,\"0,00\")","v":"0,00"},1.5,{"$f":"IF((AND(Q5<$E$40,S5>$E$40)),$E$40,\"0,00\")","v":"0,00"},10,0,{"$f":"IF((AND(T5<$E$40,V5>$E$40)),$E$40,\"0,00\")","v":"0,00"},0.5,{"$f":"IF((AND(V5<$E$40,X5>$E$40)),$E$40,\"0,00\")","v":"0,00"},1,{"$f":"IF((AND(X5<$E$40,Z5>$E$40)),$E$40,\"0,00\")","v":"0,00"},1.5,{"$f":"IF((AND(Z5<$E$40,AB5>$E$40)),$E$40,\"0,00\")","v":"0,00"},10,0,{"$f":"IF((AND(AC5<$E$40,AE5>$E$40)),$E$40,\"0,00\")","v":"0,00"},0.5,{"$f":"IF((AND(AE5<$E$40,AG5>$E$40)),$E$40,\"0,00\")","v":"0,00"},1,{"$f":"IF((AND(AG5<$E$40,AI5>$E$40)),$E$40,\"0,00\")","v":"0,00"},1.5,{"$f":"IF((AND(AI5<$E$40,AK5>$E$40)),$E$40,\"0,00\")","v":"0,00"},10]
[0,{"$f":"B10+((($A$6-$A$10)/($A$8-$A$10))*(B8-B10))","v":1.93},{"$f":"B6+(((C$5-B$5)/(D$5-B$5))*(D6-B6))","v":1.93},{"$f":"D10+((($A$6-$A$10)/($A$8-$A$10))*(D8-D10))","v":1.3200000000000003},1.6300000000000008,{"$f":"F10+((($A$6-$A$10)/($A$8-$A$10))*(F8-F10))","v":1.0099999999999998},1.4099999999999995,{"$f":"H10+((($A$6-$A$10)/($A$8-$A$10))*(H8-H10))","v":0.80999999999999994},0.95294117647058818,{"$f":"J10+((($A$6-$A$10)/($A$8-$A$10))*(J8-J10))","v":0},{"$f":"K10+((($A$6-$A$10)/($A$8-$A$10))*(K8-K10))","v":1.4099999999999997},{"$f":"K6+(((L$5-K$5)/(M$5-K$5))*(M6-K6))","v":1.4099999999999997},{"$f":"M10+((($A$6-$A$10)/($A$8-$A$10))*(M8-M10))","v":1.06},{"$f":"M6+(((N$5-M$5)/(O$5-M$5))*(O6-M6))","v":1.27},{"$f":"O10+((($A$6-$A$10)/($A$8-$A$10))*(O8-O10))","v":0.85},{"$f":"O6+(((P$5-O$5)/(Q$5-O$5))*(Q6-O6))","v":1.1299999999999999},{"$f":"Q10+((($A$6-$A$10)/($A$8-$A$10))*(Q8-Q10))","v":0.71},{"$f":"Q6+(((R$5-Q$5)/(S$5-Q$5))*(S6-Q6))","v":0.83529411764705874},{"$f":"S10+((($A$6-$A$10)/($A$8-$A$10))*(S8-S10))","v":0},{"$f":"T10+((($A$6-$A$10)/($A$8-$A$10))*(T8-T10))","v":0.93},{"$f":"T6+(((U$5-T$5)/(V$5-T$5))*(V6-T6))","v":0.93},{"$f":"V10+((($A$6-$A$10)/($A$8-$A$10))*(V8-V10))","v":0.76},{"$f":"V6+(((W$5-V$5)/(X$5-V$5))*(X6-V6))","v":0.86999999999999988},{"$f":"X10+((($A$6-$A$10)/($A$8-$A$10))*(X8-X10))","v":0.65000000000000013},{"$f":"X6+(((Y$5-X$5)/(Z$5-X$5))*(Z6-X6))","v":0.83000000000000029},{"$f":"Z10+((($A$6-$A$10)/($A$8-$A$10))*(Z8-Z10))","v":0.56000000000000005},{"$f":"Z6+(((AA$5-Z$5)/(AB$5-Z$5))*(AB6-Z6))","v":0.65882352941176481},{"$f":"AB10+((($A$6-$A$10)/($A$8-$A$10))*(AB8-AB10))","v":0},{"$f":"AC10+((($A$6-$A$10)/($A$8-$A$10))*(AC8-AC10))","v":0.67999999999999994},{"$f":"AC6+(((AD$5-AC$5)/(AE$5-AC$5))*(AE6-AC6))","v":0.67999999999999994},{"$f":"AE10+((($A$6-$A$10)/($A$8-$A$10))*(AE8-AE10))","v":0.58000000000000007},{"$f":"AE6+(((AF$5-AE$5)/(AG$5-AE$5))*(AG6-AE6))","v":0.64000000000000012},{"$f":"AG10+((($A$6-$A$10)/($A$8-$A$10))*(AG8-AG10))","v":0.52},{"$f":"AG6+(((AH$5-AG$5)/(AI$5-AG$5))*(AI6-AG6))","v":0.64000000000000012},{"$f":"AI10+((($A$6-$A$10)/($A$8-$A$10))*(AI8-AI10))","v":0.45999999999999996},{"$f":"AI6+(((AJ$5-AI$5)/(AK$5-AI$5))*(AK6-AI6))","v":0.54117647058823526},{"$f":"AK10+((($A$6-$A$10)/($A$8-$A$10))*(AK8-AK10))","v":0}]
[{"$f":"IF((AND(A6<$B$40,A8>$B$40)),$B$40,\"0,0\")","v":"0,0"},{"$f":"B8+((($A7-$A8)/($A6-$A8))*(B6-B8))","v":1.93},1.93,{"$f":"D8+((($A7-$A8)/($A6-$A8))*(D6-D8))","v":1.3200000000000003},1.6300000000000008,{"$f":"F8+((($A7-$A8)/($A6-$A8))*(F6-F8))","v":1.0099999999999998},1.4099999999999995,{"$f":"H8+((($A7-$A8)/($A6-$A8))*(H6-H8))","v":0.80999999999999994},0.95294117647058818,{"$f":"J8+((($A7-$A8)/($A6-$A8))*(J6-J8))","v":0},{"$f":"K8+((($A7-$A8)/($A6-$A8))*(K6-K8))","v":1.4099999999999997},1.4099999999999997,{"$f":"M8+((($A7-$A8)/($A6-$A8))*(M6-M8))","v":1.06},1.27,{"$f":"O8+((($A7-$A8)/($A6-$A8))*(O6-O8))","v":0.85},1.1299999999999999,{"$f":"Q8+((($A7-$A8)/($A6-$A8))*(Q6-Q8))","v":0.71},0.83529411764705874,{"$f":"S8+((($A7-$A8)/($A6-$A8))*(S6-S8))","v":0},{"$f":"T8+((($A7-$A8)/($A6-$A8))*(T6-T8))","v":0.93},0.93,{"$f":"V8+((($A7-$A8)/($A6-$A8))*(V6-V8))","v":0.76},0.86999999999999988,{"$f":"X8+((($A7-$A8)/($A6-$A8))*(X6-X8))","v":0.65000000000000013},0.83000000000000029,{"$f":"Z8+((($A7-$A8)/($A6-$A8))*(Z6-Z8))","v":0.56000000000000005},0.65882352941176481,{"$f":"AB8+((($A7-$A8)/($A6-$A8))*(AB6-AB8))","v":0},{"$f":"AC8+((($A7-$A8)/($A6-$A8))*(AC6-AC8))","v":0.67999999999999994},0.67999999999999994,{"$f":"AE8+((($A7-$A8)/($A6-$A8))*(AE6-AE8))","v":0.58000000000000007},0.64000000000000012,{"$f":"AG8+((($A7-$A8)/($A6-$A8))*(AG6-AG8))","v":0.52},0.64000000000000012,{"$f":"AI8+((($A7-$A8)/($A6-$A8))*(AI6-AI8))","v":0.45999999999999996},0.54117647058823526,{"$f":"AK8+((($A7-$A8)/($A6-$A8))*(AK6-AK8))","v":0}]
[1,1.51,1.51,1.07,1.3000000000000003,0.84,1.1400000000000001,0.69,0.81176470588235294,0,1.1399999999999999,1.1399999999999999,0.88,1.04,0.72,0.94,0.61,0.71764705882352942,0,0.78,0.78,0.65,0.74,0.56000000000000005,0.70000000000000018,0.49,0.57647058823529407,0,0.59,0.59,0.51,0.56000000000000005,0.46,0.56000000000000005,0.41,0.48235294117647054,0]
[{"$f":"IF((AND(A8<$B$40,A10>$B$40)),$B$40,\"0,0\")","v":"0,0"},{"$f":"B10+((($A9-$A10)/($A8-$A10))*(B8-B10))","v":1.93},1.93,{"$f":"D10+((($A9-$A10)/($A8-$A10))*(D8-D10))","v":1.3200000000000003},1.6300000000000008,{"$f":"F10+((($A9-$A10)/($A8-$A10))*(F8-F10))","v":1.0099999999999998},1.4099999999999995,{"$f":"H10+((($A9-$A10)/($A8-$A10))*(H8-H10))","v":0.80999999999999994},0.95294117647058818,{"$f":"J10+((($A9-$A10)/($A8-$A10))*(J8-J10))","v":0},{"$f":"K10+((($A9-$A10)/($A8-$A10))*(K8-K10))","v":1.4099999999999997},1.4099999999999997,{"$f":"M10+((($A9-$A10)/($A8-$A10))*(M8-M10))","v":1.06},1.27,{"$f":"O10+((($A9-$A10)/($A8-$A10))*(O8-O10))","v":0.85},1.1299999999999999,{"$f":"Q10+((($A9-$A10)/($A8-$A10))*(Q8-Q10))","v":0.71},0.83529411764705874,{"$f":"S10+((($A9-$A10)/($A8-$A10))*(S8-S10))","v":0},{"$f":"T10+((($A9-$A10)/($A8-$A10))*(T8-T10))","v":0.93},0.93,{"$f":"V10+((($A9-$A10)/($A8-$A10))*(V8-V10))","v":0.76},0.86999999999999988,{"$f":"X10+((($A9-$A10)/($A8-$A10))*(X8-X10))","v":0.65000000000000013},0.83000000000000029,{"$f":"Z10+((($A9-$A10)/($A8-$A10))*(Z8-Z10))","v":0.56000000000000005},0.65882352941176481,{"$f":"AB10+((($A9-$A10)/($A8-$A10))*(AB8-AB10))","v":0},{"$f":"AC10+((($A9-$A10)/($A8-$A10))*(AC8-AC10))","v":0.67999999999999994},0.67999999999999994,{"$f":"AE10+((($A9-$A10)/($A8-$A10))*(AE8-AE10))","v":0.58000000000000007},0.64000000000000012,{"$f":"AG10+((($A9-$A10)/($A8-$A10))*(AG8-AG10))","v":0.52},0.64000000000000012,{"$f":"AI10+((($A9-$A10)/($A8-$A10))*(AI8-AI10))","v":0.45999999999999996},0.54117647058823526,{"$f":"AK10+((($A9-$A10)/($A8-$A10))*(AK8-AK10))","v":0}]
[2,1.0900000000000001,1.0900000000000001,0.82,0.96999999999999986,0.67,0.87000000000000022,0.56999999999999995,0.6705882352941176,0,0.87,0.87,0.7,0.80999999999999994,0.59,0.74999999999999989,0.51,0.6,0,0.63,0.63,0.54,0.6100000000000001,0.47,0.56999999999999995,0.42,0.49411764705882355,0,0.5,0.5,0.44,0.48,0.4,0.48000000000000009,0.36,0.42352941176470588,0]
[{"$f":"IF((AND(A10<$B$40,A12>$B$40)),$B$40,\"0,0\")","v":"0,0"},{"$f":"B12+((($A11-$A12)/($A10-$A12))*(B10-B12))","v":1.5300000000000002},1.5300000000000002,{"$f":"D12+((($A11-$A12)/($A10-$A12))*(D10-D12))","v":1.0999999999999996},1.3299999999999992,{"$f":"F12+((($A11-$A12)/($A10-$A12))*(F10-F12))","v":0.87000000000000022},1.1500000000000008,{"$f":"H12+((($A11-$A12)/($A10-$A12))*(H10-H12))","v":0.72999999999999987},0.85882352941176454,{"$f":"J12+((($A11-$A12)/($A10-$A12))*(J10-J12))","v":0},{"$f":"K12+((($A11-$A12)/($A10-$A12))*(K10-K12))","v":1.19},1.19,{"$f":"M12+((($A11-$A12)/($A10-$A12))*(M10-M12))","v":0.91999999999999993},1.0699999999999998,{"$f":"O12+((($A11-$A12)/($A10-$A12))*(O10-O12))","v":0.76999999999999991},1.0099999999999998,{"$f":"Q12+((($A11-$A12)/($A10-$A12))*(Q10-Q12))","v":0.65},0.76470588235294124,{"$f":"S12+((($A11-$A12)/($A10-$A12))*(S10-S12))","v":0},{"$f":"T12+((($A11-$A12)/($A10-$A12))*(T10-T12))","v":0.83},0.83,{"$f":"V12+((($A11-$A12)/($A10-$A12))*(V10-V12))","v":0.68000000000000016},0.77000000000000035,{"$f":"X12+((($A11-$A12)/($A10-$A12))*(X10-X12))","v":0.59},0.72999999999999987,{"$f":"Z12+((($A11-$A12)/($A10-$A12))*(Z10-Z12))","v":0.52},0.61176470588235299,{"$f":"AB12+((($A11-$A12)/($A10-$A12))*(AB10-AB12))","v":0},{"$f":"AC12+((($A11-$A12)/($A10-$A12))*(AC10-AC12))","v":0.64},0.64,{"$f":"AE12+((($A11-$A12)/($A10-$A12))*(AE10-AE12))","v":0.54},0.57999999999999996,{"$f":"AG12+((($A11-$A12)/($A10-$A12))*(AG10-AG12))","v":0.50000000000000011},0.62000000000000044,{"$f":"AI12+((($A11-$A12)/($A10-$A12))*(AI10-AI12))","v":0.43999999999999995},0.51764705882352935,{"$f":"AK12+((($A11-$A12)/($A10-$A12))*(AK10-AK12))","v":0}]
[3,0.87,0.87,0.68,0.79000000000000015,0.56999999999999995,0.72999999999999987,0.49,0.57647058823529407,0,0.71,0.71,0.59,0.67999999999999994,0.5,0.62,0.44,0.51764705882352946,0,0.53,0.53,0.47,0.53,0.41,0.48999999999999994,0.37,0.43529411764705883,0,0.43,0.43,0.39,0.43000000000000005,0.35,0.40999999999999992,0.32,0.37647058823529411,0]
[{"$f":"IF((AND(A12<$B$40,A14>$B$40)),$B$40,\"0,0\")","v":"0,0"},{"$f":"B14+((($A13-$A14)/($A12-$A14))*(B12-B14))","v":1.26},1.26,{"$f":"D14+((($A13-$A14)/($A12-$A14))*(D12-D14))","v":0.95000000000000029},1.0900000000000007,{"$f":"F14+((($A13-$A14)/($A12-$A14))*(F12-F14))","v":0.80999999999999983},1.0899999999999996,{"$f":"H14+((($A13-$A14)/($A12-$A14))*(H12-H14))","v":0.66999999999999993},0.78823529411764692,{"$f":"J14+((($A13-$A14)/($A12-$A14))*(J12-J14))","v":0},{"$f":"K14+((($A13-$A14)/($A12-$A14))*(K12-K14))","v":1.0099999999999998},1.0099999999999998,{"$f":"M14+((($A13-$A14)/($A12-$A14))*(M12-M14))","v":0.82999999999999985},0.97999999999999976,{"$f":"O14+((($A13-$A14)/($A12-$A14))*(O12-O14))","v":0.67999999999999994},0.85999999999999988,{"$f":"Q14+((($A13-$A14)/($A12-$A14))*(Q12-Q14))","v":0.59},0.69411764705882351,{"$f":"S14+((($A13-$A14)/($A12-$A14))*(S12-S14))","v":0},{"$f":"T14+((($A13-$A14)/($A12-$A14))*(T12-T14))","v":0.71000000000000019},0.71000000000000019,{"$f":"V14+((($A13-$A14)/($A12-$A14))*(V12-V14))","v":0.64999999999999991},0.76999999999999991,{"$f":"X14+((($A13-$A14)/($A12-$A14))*(X12-X14))","v":0.52999999999999992},0.66999999999999993,{"$f":"Z14+((($A13-$A14)/($A12-$A14))*(Z12-Z14))","v":0.45999999999999991},0.54117647058823515,{"$f":"AB14+((($A13-$A14)/($A12-$A14))*(AB12-AB14))","v":0},{"$f":"AC14+((($A13-$A14)/($A12-$A14))*(AC12-AC14))","v":0.54999999999999993},0.54999999999999993,{"$f":"AE14+((($A13-$A14)/($A12-$A14))*(AE12-AE14))","v":0.51000000000000012},0.58000000000000029,{"$f":"AG14+((($A13-$A14)/($A12-$A14))*(AG12-AG14))","v":0.43999999999999989},0.4999999999999995,{"$f":"AI14+((($A13-$A14)/($A12-$A14))*(AI12-AI14))","v":0.41000000000000009},0.48235294117647071,{"$f":"AK14+((($A13-$A14)/($A12-$A14))*(AK12-AK14))","v":0}]
[4,0.74,0.74,0.59,0.69,0.49,0.61,0.43,0.50588235294117645,0,0.61,0.61,0.51,0.58000000000000007,0.44,0.54,0.39,0.45882352941176474,0,0.47,0.47,0.41,0.44999999999999996,0.37,0.42999999999999994,0.34,0.4,0,0.39,0.39,0.35,0.37999999999999995,0.32,0.38000000000000006,0.28999999999999998,0.3411764705882353,0]
[{"$f":"IF((AND(A14<$B$40,A16>$B$40)),$B$40,\"0,0\")","v":"0,0"},{"$f":"B16+((($A15-$A16)/($A14-$A16))*(B14-B16))","v":1.1399999999999999},1.1399999999999999,{"$f":"D16+((($A15-$A16)/($A14-$A16))*(D14-D16))","v":0.86999999999999977},1.0499999999999996,{"$f":"F16+((($A15-$A16)/($A14-$A16))*(F14-F16))","v":0.69},0.89000000000000012,{"$f":"H16+((($A15-$A16)/($A14-$A16))*(H14-H16))","v":0.58999999999999986},0.69411764705882339,{"$f":"J16+((($A15-$A16)/($A14-$A16))*(J14-J16))","v":0},{"$f":"K16+((($A15-$A16)/($A14-$A16))*(K14-K16))","v":0.88999999999999979},0.88999999999999979,{"$f":"M16+((($A15-$A16)/($A14-$A16))*(M14-M16))","v":0.75},0.90000000000000013,{"$f":"O16+((($A15-$A16)/($A14-$A16))*(O14-O16))","v":0.59999999999999987},0.77999999999999936,{"$f":"Q16+((($A15-$A16)/($A14-$A16))*(Q14-Q16))","v":0.51000000000000012},0.60000000000000009,{"$f":"S16+((($A15-$A16)/($A14-$A16))*(S14-S16))","v":0},{"$f":"T16+((($A15-$A16)/($A14-$A16))*(T14-T16))","v":0.66999999999999993},0.66999999999999993,{"$f":"V16+((($A15-$A16)/($A14-$A16))*(V14-V16))","v":0.56999999999999984},0.6499999999999998,{"$f":"X16+((($A15-$A16)/($A14-$A16))*(X14-X16))","v":0.48999999999999988},0.54999999999999938,{"$f":"Z16+((($A15-$A16)/($A14-$A16))*(Z14-Z16))","v":0.46000000000000013},0.54117647058823548,{"$f":"AB16+((($A15-$A16)/($A14-$A16))*(AB14-AB16))","v":0},{"$f":"AC16+((($A15-$A16)/($A14-$A16))*(AC14-AC16))","v":0.55000000000000016},0.55000000000000016,{"$f":"AE16+((($A15-$A16)/($A14-$A16))*(AE14-AE16))","v":0.46999999999999986},0.49999999999999961,{"$f":"AG16+((($A15-$A16)/($A14-$A16))*(AG14-AG16))","v":0.44000000000000011},0.58000000000000074,{"$f":"AI16+((($A15-$A16)/($A14-$A16))*(AI14-AI16))","v":0.36999999999999983},0.43529411764705861,{"$f":"AK16+((($A15-$A16)/($A14-$A16))*(AK14-AK16))","v":0}]
[5,0.64,0.64,0.52,0.60000000000000009,0.44,0.54,0.39,0.45882352941176474,0,0.54,0.54,0.45,0.5,0.4,0.48000000000000009,0.36,0.42352941176470588,0,0.42,0.42,0.37,0.39999999999999997,0.34,0.40000000000000008,0.31,0.36470588235294116,0,0.35,0.35,0.32,0.35000000000000003,0.28999999999999998,0.3299999999999999,0.27,0.31764705882352945,0]
[{"$f":"IF((AND(A16<$B$40,A18>$B$40)),$B$40,\"0,0\")","v":"0,0"},{"$f":"B18+((($A17-$A18)/($A16-$A18))*(B16-B18))","v":0.99000000000000032},0.99000000000000032,{"$f":"D18+((($A17-$A18)/($A16-$A18))*(D16-D18))","v":0.82000000000000006},1.0000000000000002,{"$f":"F18+((($A17-$A18)/($A16-$A18))*(F16-F18))","v":0.6399999999999999},0.73999999999999932,{"$f":"H18+((($A17-$A18)/($A16-$A18))*(H16-H18))","v":0.59000000000000019},0.69411764705882373,{"$f":"J18+((($A17-$A18)/($A16-$A18))*(J16-J18))","v":0},{"$f":"K18+((($A17-$A18)/($A16-$A18))*(K16-K18))","v":0.8400000000000003},0.8400000000000003,{"$f":"M18+((($A17-$A18)/($A16-$A18))*(M16-M18))","v":0.65000000000000013},0.70000000000000007,{"$f":"O18+((($A17-$A18)/($A16-$A18))*(O16-O18))","v":0.6000000000000002},0.78000000000000103,{"$f":"Q18+((($A17-$A18)/($A16-$A18))*(Q16-Q18))","v":0.50999999999999979},0.59999999999999976,{"$f":"S18+((($A17-$A18)/($A16-$A18))*(S16-S18))","v":0},{"$f":"T18+((($A17-$A18)/($A16-$A18))*(T16-T18))","v":0.61999999999999988},0.61999999999999988,{"$f":"V18+((($A17-$A18)/($A16-$A18))*(V16-V18))","v":0.5199999999999998},0.54999999999999938,{"$f":"X18+((($A17-$A18)/($A16-$A18))*(X16-X18))","v":0.49000000000000016},0.55000000000000071,{"$f":"Z18+((($A17-$A18)/($A16-$A18))*(Z16-Z18))","v":0.45999999999999985},0.54117647058823515,{"$f":"AB18+((($A17-$A18)/($A16-$A18))*(AB16-AB18))","v":0},{"$f":"AC18+((($A17-$A18)/($A16-$A18))*(AC16-AC18))","v":0.49999999999999983},0.49999999999999983,{"$f":"AE18+((($A17-$A18)/($A16-$A18))*(AE16-AE18))","v":0.47000000000000014},0.55000000000000049,{"$f":"AG18+((($A17-$A18)/($A16-$A18))*(AG16-AG18))","v":0.38999999999999979},0.42999999999999916,{"$f":"AI18+((($A17-$A18)/($A16-$A18))*(AI16-AI18))","v":0.37000000000000011},0.43529411764705894,{"$f":"AK18+((($A17-$A18)/($A16-$A18))*(AK16-AK18))","v":0}]
[6,0.56999999999999995,0.56999999999999995,0.46,0.52,0.4,0.50000000000000011,0.35,0.41176470588235292,0,0.48,0.48,0.41,0.45999999999999996,0.36,0.41999999999999993,0.33,0.38823529411764707,0,0.38,0.38,0.34,0.37000000000000005,0.31,0.36999999999999994,0.28000000000000003,0.3294117647058824,0,0.32,0.32,0.28999999999999998,0.30999999999999994,0.27,0.31000000000000005,0.25,0.29411764705882354,0]
[{"$f":"IF((AND(A18<$B$40,A20>$B$40)),$B$40,\"0,0\")","v":"0,0"},{"$f":"B20+((($A19-$A20)/($A18-$A20))*(B18-B20))","v":0.86999999999999955},0.86999999999999955,{"$f":"D20+((($A19-$A20)/($A18-$A20))*(D18-D20))","v":0.70000000000000018},0.82000000000000017,{"$f":"F20+((($A19-$A20)/($A18-$A20))*(F18-F20))","v":0.58000000000000018},0.80000000000000104,{"$f":"H20+((($A19-$A20)/($A18-$A20))*(H18-H20))","v":0.46999999999999975},0.55294117647058794,{"$f":"J20+((($A19-$A20)/($A18-$A20))*(J18-J20))","v":0},{"$f":"K20+((($A19-$A20)/($A18-$A20))*(K18-K20))","v":0.71999999999999986},0.71999999999999986,{"$f":"M20+((($A19-$A20)/($A18-$A20))*(M18-M20))","v":0.58999999999999986},0.6399999999999999,{"$f":"O20+((($A19-$A20)/($A18-$A20))*(O18-O20))","v":0.53999999999999981},0.59999999999999898,{"$f":"Q20+((($A19-$A20)/($A18-$A20))*(Q18-Q20))","v":0.51000000000000023},0.60000000000000031,{"$f":"S20+((($A19-$A20)/($A18-$A20))*(S18-S20))","v":0},{"$f":"T20+((($A19-$A20)/($A18-$A20))*(T18-T20))","v":0.56000000000000016},0.56000000000000016,{"$f":"V20+((($A19-$A20)/($A18-$A20))*(V18-V20))","v":0.52000000000000024},0.61000000000000032,{"$f":"X20+((($A19-$A20)/($A18-$A20))*(X18-X20))","v":0.4300000000000001},0.49000000000000005,{"$f":"Z20+((($A19-$A20)/($A18-$A20))*(Z18-Z20))","v":0.40000000000000013},0.47058823529411781,{"$f":"AB20+((($A19-$A20)/($A18-$A20))*(AB18-AB20))","v":0},{"$f":"AC20+((($A19-$A20)/($A18-$A20))*(AC18-AC20))","v":0.44000000000000011},0.44000000000000011,{"$f":"AE20+((($A19-$A20)/($A18-$A20))*(AE18-AE20))","v":0.40999999999999975},0.42999999999999938,{"$f":"AG20+((($A19-$A20)/($A18-$A20))*(AG18-AG20))","v":0.39000000000000012},0.55000000000000027,{"$f":"AI20+((($A19-$A20)/($A18-$A20))*(AI18-AI20))","v":0.31000000000000005},0.36470588235294121,{"$f":"AK20+((($A19-$A20)/($A18-$A20))*(AK18-AK20))","v":0}]
[7,0.52,0.52,0.42,0.47,0.37,0.44999999999999996,0.33,0.38823529411764707,0,0.44,0.44,0.38,0.43,0.33,0.39000000000000007,0.3,0.3529411764705882,0,0.35,0.35,0.31,0.33,0.28999999999999998,0.34999999999999992,0.26,0.30588235294117649,0,0.3,0.3,0.27,0.29000000000000004,0.25,0.27,0.24,0.28235294117647058,0]
[{"$f":"IF((AND(A20<$B$40,A22>$B$40)),$B$40,\"0,0\")","v":"0,0"},{"$f":"B22+((($A21-$A22)/($A20-$A22))*(B20-B22))","v":0.87000000000000033},0.87000000000000033,{"$f":"D22+((($A21-$A22)/($A20-$A22))*(D20-D22))","v":0.62999999999999978},0.67999999999999972,{"$f":"F22+((($A21-$A22)/($A20-$A22))*(F20-F22))","v":0.57999999999999985},0.65999999999999903,{"$f":"H22+((($A21-$A22)/($A20-$A22))*(H20-H22))","v":0.54000000000000026},0.63529411764705912,{"$f":"J22+((($A21-$A22)/($A20-$A22))*(J20-J22))","v":0},{"$f":"K22+((($A21-$A22)/($A20-$A22))*(K20-K22))","v":0.71999999999999986},0.71999999999999986,{"$f":"M22+((($A21-$A22)/($A20-$A22))*(M20-M22))","v":0.59000000000000019},0.71000000000000019,{"$f":"O22+((($A21-$A22)/($A20-$A22))*(O20-O22))","v":0.47000000000000014},0.53000000000000091,{"$f":"Q22+((($A21-$A22)/($A20-$A22))*(Q20-Q22))","v":0.43999999999999972},0.51764705882352913,{"$f":"S22+((($A21-$A22)/($A20-$A22))*(S20-S22))","v":0},{"$f":"T22+((($A21-$A22)/($A20-$A22))*(T20-T22))","v":0.48999999999999971},0.48999999999999971,{"$f":"V22+((($A21-$A22)/($A20-$A22))*(V20-V22))","v":0.45000000000000012},0.47000000000000053,{"$f":"X22+((($A21-$A22)/($A20-$A22))*(X20-X22))","v":0.42999999999999972},0.62999999999999901,{"$f":"Z22+((($A21-$A22)/($A20-$A22))*(Z20-Z22))","v":0.33000000000000007},0.38823529411764712,{"$f":"AB22+((($A21-$A22)/($A20-$A22))*(AB20-AB22))","v":0},{"$f":"AC22+((($A21-$A22)/($A20-$A22))*(AC20-AC22))","v":0.43999999999999972},0.43999999999999972,{"$f":"AE22+((($A21-$A22)/($A20-$A22))*(AE20-AE22))","v":0.34000000000000008},0.3600000000000001,{"$f":"AG22+((($A21-$A22)/($A20-$A22))*(AG20-AG22))","v":0.32000000000000006},0.2000000000000004,{"$f":"AI22+((($A21-$A22)/($A20-$A22))*(AI20-AI22))","v":0.37999999999999989},0.44705882352941162,{"$f":"AK22+((($A21-$A22)/($A20-$A22))*(AK20-AK22))","v":0}]
[8,0.47,0.47,0.39,0.44,0.34,0.4200000000000001,0.3,0.3529411764705882,0,0.4,0.4,0.35,0.38999999999999996,0.31,0.36999999999999994,0.28000000000000003,0.3294117647058824,0,0.33,0.33,0.28999999999999998,0.30999999999999994,0.27,0.31000000000000005,0.25,0.29411764705882354,0,0.28000000000000003,0.28000000000000003,0.26,0.28000000000000003,0.24,0.27999999999999997,0.22,0.25882352941176473,0]
[{"$f":"IF((AND(A22<$B$40,A24>$B$40)),$B$40,\"0,0\")","v":"0,0"},{"$f":"B24+((($A23-$A24)/($A22-$A24))*(B22-B24))","v":0.78999999999999981},0.78999999999999981,{"$f":"D24+((($A23-$A24)/($A22-$A24))*(D22-D24))","v":0.63000000000000023},0.76000000000000023,{"$f":"F24+((($A23-$A24)/($A22-$A24))*(F22-F24))","v":0.50000000000000022},0.58000000000000129,{"$f":"H24+((($A23-$A24)/($A22-$A24))*(H22-H24))","v":0.45999999999999969},0.54117647058823493,{"$f":"J24+((($A23-$A24)/($A22-$A24))*(J22-J24))","v":0},{"$f":"K24+((($A23-$A24)/($A22-$A24))*(K22-K24))","v":0.64000000000000024},0.64000000000000024,{"$f":"M24+((($A23-$A24)/($A22-$A24))*(M22-M24))","v":0.58999999999999975},0.7099999999999993,{"$f":"O24+((($A23-$A24)/($A22-$A24))*(O22-O24))","v":0.47000000000000014},0.53,{"$f":"Q24+((($A23-$A24)/($A22-$A24))*(Q22-Q24))","v":0.44000000000000017},0.51764705882352957,{"$f":"S24+((($A23-$A24)/($A22-$A24))*(S22-S24))","v":0},{"$f":"T24+((($A23-$A24)/($A22-$A24))*(T22-T24))","v":0.57000000000000028},0.57000000000000028,{"$f":"V24+((($A23-$A24)/($A22-$A24))*(V22-V24))","v":0.44999999999999968},0.4699999999999992,{"$f":"X24+((($A23-$A24)/($A22-$A24))*(X22-X24))","v":0.43000000000000016},0.47000000000000064,{"$f":"Z24+((($A23-$A24)/($A22-$A24))*(Z22-Z24))","v":0.40999999999999992},0.48235294117647048,{"$f":"AB24+((($A23-$A24)/($A22-$A24))*(AB22-AB24))","v":0},{"$f":"AC24+((($A23-$A24)/($A22-$A24))*(AC22-AC24))","v":0.44000000000000017},0.44000000000000017,{"$f":"AE24+((($A23-$A24)/($A22-$A24))*(AE22-AE24))","v":0.42000000000000015},0.44000000000000039,{"$f":"AG24+((($A23-$A24)/($A22-$A24))*(AG22-AG24))","v":0.39999999999999991},0.59999999999999964,{"$f":"AI24+((($A23-$A24)/($A22-$A24))*(AI22-AI24))","v":0.30000000000000004},0.35294117647058831,{"$f":"AK24+((($A23-$A24)/($A22-$A24))*(AK22-AK24))","v":0}]
[9,0.43,0.43,0.36,0.39999999999999997,0.32,0.39999999999999997,0.28000000000000003,0.3294117647058824,0,0.37,0.37,0.32,0.35000000000000003,0.28999999999999998,0.34999999999999992,0.26,0.30588235294117649,0,0.3,0.3,0.27,0.29000000000000004,0.25,0.28999999999999998,0.23,0.27058823529411768,0,0.26,0.26,0.24,0.26,0.22,0.24000000000000002,0.21,0.24705882352941178,0]
[{"$f":"IF((AND(A24<$B$40,A26>$B$40)),$B$40,\"0,0\")","v":"0,0"},{"$f":"B26+((($A25-$A26)/($A24-$A26))*(B24-B26))","v":0.69999999999999973},0.69999999999999973,{"$f":"D26+((($A25-$A26)/($A24-$A26))*(D24-D26))","v":0.53999999999999959},0.57999999999999896,{"$f":"F26+((($A25-$A26)/($A24-$A26))*(F24-F26))","v":0.50000000000000022},0.76000000000000045,{"$f":"H26+((($A25-$A26)/($A24-$A26))*(H24-H26))","v":0.37000000000000011},0.43529411764705894,{"$f":"J26+((($A25-$A26)/($A24-$A26))*(J24-J26))","v":0},{"$f":"K26+((($A25-$A26)/($A24-$A26))*(K24-K26))","v":0.55000000000000016},0.55000000000000016,{"$f":"M26+((($A25-$A26)/($A24-$A26))*(M24-M26))","v":0.50000000000000022},0.5300000000000008,{"$f":"O26+((($A25-$A26)/($A24-$A26))*(O24-O26))","v":0.46999999999999964},0.70999999999999874,{"$f":"Q26+((($A25-$A26)/($A24-$A26))*(Q24-Q26))","v":0.35000000000000009},0.41176470588235303,{"$f":"S26+((($A25-$A26)/($A24-$A26))*(S24-S26))","v":0},{"$f":"T26+((($A25-$A26)/($A24-$A26))*(T24-T26))","v":0.39000000000000007},0.39000000000000007,{"$f":"V26+((($A25-$A26)/($A24-$A26))*(V24-V26))","v":0.3600000000000001},0.38000000000000012,{"$f":"X26+((($A25-$A26)/($A24-$A26))*(X24-X26))","v":0.34000000000000008},0.38000000000000012,{"$f":"Z26+((($A25-$A26)/($A24-$A26))*(Z24-Z26))","v":0.32000000000000006},0.37647058823529422,{"$f":"AB26+((($A25-$A26)/($A24-$A26))*(AB24-AB26))","v":0},{"$f":"AC26+((($A25-$A26)/($A24-$A26))*(AC24-AC26))","v":0.35000000000000009},0.35000000000000009,{"$f":"AE26+((($A25-$A26)/($A24-$A26))*(AE24-AE26))","v":0.32999999999999985},0.34999999999999964,{"$f":"AG26+((($A25-$A26)/($A24-$A26))*(AG24-AG26))","v":0.31000000000000005},0.33000000000000052,{"$f":"AI26+((($A25-$A26)/($A24-$A26))*(AI24-AI26))","v":0.29999999999999982},0.35294117647058804,{"$f":"AK26+((($A25-$A26)/($A24-$A26))*(AK24-AK26))","v":0}]
[10,0.4,0.4,0.34,0.38000000000000006,0.3,0.35999999999999993,0.27,0.31764705882352945,0,0.35,0.35,0.3,0.32999999999999996,0.27,0.31000000000000005,0.25,0.29411764705882354,0,0.28999999999999998,0.28999999999999998,0.26,0.28000000000000003,0.24,0.27999999999999997,0.22,0.25882352941176473,0,0.25,0.25,0.23,0.25,0.21,0.22999999999999995,0.2,0.23529411764705885,0]
[{"$f":"IF((AND(A26<$B$40,A28>$B$40)),$B$40,\"0,0\")","v":"0,0"},{"$f":"B28+((($A27-$A28)/($A26-$A28))*(B26-B28))","v":0.6000000000000002},0.6000000000000002,{"$f":"D28+((($A27-$A28)/($A26-$A28))*(D26-D28))","v":0.54000000000000026},0.63000000000000067,{"$f":"F28+((($A27-$A28)/($A26-$A28))*(F26-F28))","v":0.44999999999999984},0.50999999999999923,{"$f":"H28+((($A27-$A28)/($A26-$A28))*(H26-H28))","v":0.42000000000000015},0.49411764705882372,{"$f":"J28+((($A27-$A28)/($A26-$A28))*(J26-J28))","v":0},{"$f":"K28+((($A27-$A28)/($A26-$A28))*(K26-K28))","v":0.54999999999999982},0.54999999999999982,{"$f":"M28+((($A27-$A28)/($A26-$A28))*(M26-M28))","v":0.44999999999999984},0.47999999999999954,{"$f":"O28+((($A27-$A28)/($A26-$A28))*(O26-O28))","v":0.42000000000000015},0.46000000000000041,{"$f":"Q28+((($A27-$A28)/($A26-$A28))*(Q26-Q28))","v":0.4},0.4705882352941177,{"$f":"S28+((($A27-$A28)/($A26-$A28))*(S26-S28))","v":0},{"$f":"T28+((($A27-$A28)/($A26-$A28))*(T26-T28))","v":0.43999999999999984},0.43999999999999984,{"$f":"V28+((($A27-$A28)/($A26-$A28))*(V26-V28))","v":0.41000000000000003},0.43000000000000005,{"$f":"X28+((($A27-$A28)/($A26-$A28))*(X26-X28))","v":0.39},0.53000000000000014,{"$f":"Z28+((($A27-$A28)/($A26-$A28))*(Z26-Z28))","v":0.31999999999999995},0.37647058823529406,{"$f":"AB28+((($A27-$A28)/($A26-$A28))*(AB26-AB28))","v":0},{"$f":"AC28+((($A27-$A28)/($A26-$A28))*(AC26-AC28))","v":0.4},0.4,{"$f":"AE28+((($A27-$A28)/($A26-$A28))*(AE26-AE28))","v":0.33000000000000007},0.3500000000000002,{"$f":"AG28+((($A27-$A28)/($A26-$A28))*(AG26-AG28))","v":0.30999999999999994},0.32999999999999963,{"$f":"AI28+((($A27-$A28)/($A26-$A28))*(AI26-AI28))","v":0.3000000000000001},0.35294117647058837,{"$f":"AK28+((($A27-$A28)/($A26-$A28))*(AK26-AK28))","v":0}]
[12,0.36,0.36,0.3,0.32999999999999996,0.27,0.33000000000000007,0.24,0.28235294117647058,0,0.31,0.31,0.27,0.30000000000000004,0.24,0.27999999999999997,0.22,0.25882352941176473,0,0.26,0.26,0.23,0.25,0.21,0.22999999999999995,0.2,0.23529411764705885,0,0.22,0.22,0.21,0.22999999999999998,0.19,0.21000000000000002,0.18,0.21176470588235294,0]
[{"$f":"IF((AND(A28<$B$40,A30>$B$40)),$B$40,\"0,0\")","v":"0,0"},{"$f":"B30+((($A29-$A30)/($A28-$A30))*(B28-B30))","v":0.59999999999999987},0.59999999999999987,{"$f":"D30+((($A29-$A30)/($A28-$A30))*(D28-D30))","v":0.47999999999999982},0.50999999999999945,{"$f":"F30+((($A29-$A30)/($A28-$A30))*(F28-F30))","v":0.45000000000000018},0.63000000000000067,{"$f":"H30+((($A29-$A30)/($A28-$A30))*(H28-H30))","v":0.35999999999999993},0.42352941176470582,{"$f":"J30+((($A29-$A30)/($A28-$A30))*(J28-J30))","v":0},{"$f":"K30+((($A29-$A30)/($A28-$A30))*(K28-K30))","v":0.48999999999999982},0.48999999999999982,{"$f":"M30+((($A29-$A30)/($A28-$A30))*(M28-M30))","v":0.39000000000000012},0.42000000000000032,{"$f":"O30+((($A29-$A30)/($A28-$A30))*(O28-O30))","v":0.35999999999999993},0.39999999999999986,{"$f":"Q30+((($A29-$A30)/($A28-$A30))*(Q28-Q30))","v":0.33999999999999997},0.39999999999999997,{"$f":"S30+((($A29-$A30)/($A28-$A30))*(S28-S30))","v":0},{"$f":"T30+((($A29-$A30)/($A28-$A30))*(T28-T30))","v":0.44},0.44,{"$f":"V30+((($A29-$A30)/($A28-$A30))*(V28-V30))","v":0.35000000000000009},0.43000000000000027,{"$f":"X30+((($A29-$A30)/($A28-$A30))*(X28-X30))","v":0.26999999999999991},0.16999999999999948,{"$f":"Z30+((($A29-$A30)/($A28-$A30))*(Z28-Z30))","v":0.32000000000000012},0.37647058823529428,{"$f":"AB30+((($A29-$A30)/($A28-$A30))*(AB28-AB30))","v":0},{"$f":"AC30+((($A29-$A30)/($A28-$A30))*(AC28-AC30))","v":0.33999999999999997},0.33999999999999997,{"$f":"AE30+((($A29-$A30)/($A28-$A30))*(AE28-AE30))","v":0.32999999999999996},0.40999999999999986,{"$f":"AG30+((($A29-$A30)/($A28-$A30))*(AG28-AG30))","v":0.25000000000000006},0.27000000000000041,{"$f":"AI30+((($A29-$A30)/($A28-$A30))*(AI28-AI30))","v":0.23999999999999988},0.28235294117647047,{"$f":"AK30+((($A29-$A30)/($A28-$A30))*(AK28-AK30))","v":0}]
[14,0.32,0.32,0.27,0.30000000000000004,0.24,0.27999999999999997,0.22,0.25882352941176473,0,0.28000000000000003,0.28000000000000003,0.25,0.28000000000000003,0.22,0.26,0.2,0.23529411764705885,0,0.23,0.23,0.21,0.21999999999999997,0.2,0.24000000000000005,0.18,0.21176470588235294,0,0.2,0.2,0.19,0.2,0.18,0.19999999999999996,0.17,0.2,0]
[{"$f":"IF((AND(A30<$B$40,A32>$B$40)),$B$40,\"0,0\")","v":"0,0"},{"$f":"B32+((($A31-$A32)/($A30-$A32))*(B30-B32))","v":0.53000000000000025},0.53000000000000025,{"$f":"D32+((($A31-$A32)/($A30-$A32))*(D30-D32))","v":0.41000000000000014},0.44000000000000039,{"$f":"F32+((($A31-$A32)/($A30-$A32))*(F30-F32))","v":0.37999999999999989},0.41999999999999982,{"$f":"H32+((($A31-$A32)/($A30-$A32))*(H30-H32))","v":0.35999999999999993},0.42352941176470582,{"$f":"J32+((($A31-$A32)/($A30-$A32))*(J30-J32))","v":0},{"$f":"K32+((($A31-$A32)/($A30-$A32))*(K30-K32))","v":0.49000000000000021},0.49000000000000021,{"$f":"M32+((($A31-$A32)/($A30-$A32))*(M30-M32))","v":0.3899999999999999},0.41999999999999987,{"$f":"O32+((($A31-$A32)/($A30-$A32))*(O30-O32))","v":0.35999999999999993},0.53999999999999959,{"$f":"Q32+((($A31-$A32)/($A30-$A32))*(Q30-Q32))","v":0.27000000000000007},0.3176470588235295,{"$f":"S32+((($A31-$A32)/($A30-$A32))*(S30-S32))","v":0},{"$f":"T32+((($A31-$A32)/($A30-$A32))*(T30-T32))","v":0.37000000000000011},0.37000000000000011,{"$f":"V32+((($A31-$A32)/($A30-$A32))*(V30-V32))","v":0.27999999999999986},0.21999999999999958,{"$f":"X32+((($A31-$A32)/($A30-$A32))*(X30-X32))","v":0.34000000000000014},0.52000000000000068,{"$f":"Z32+((($A31-$A32)/($A30-$A32))*(Z30-Z32))","v":0.24999999999999986},0.29411764705882337,{"$f":"AB32+((($A31-$A32)/($A30-$A32))*(AB30-AB32))","v":0},{"$f":"AC32+((($A31-$A32)/($A30-$A32))*(AC30-AC32))","v":0.27000000000000007},0.27000000000000007,{"$f":"AE32+((($A31-$A32)/($A30-$A32))*(AE30-AE32))","v":0.32999999999999996},0.33999999999999997,{"$f":"AG32+((($A31-$A32)/($A30-$A32))*(AG30-AG32))","v":0.31999999999999995},0.4799999999999997,{"$f":"AI32+((($A31-$A32)/($A30-$A32))*(AI30-AI32))","v":0.24000000000000007},0.2823529411764707,{"$f":"AK32+((($A31-$A32)/($A30-$A32))*(AK30-AK32))","v":0}]
[16,0.28999999999999998,0.28999999999999998,0.25,0.28000000000000003,0.22,0.26,0.2,0.23529411764705885,0,0.25,0.25,0.23,0.26,0.2,0.22000000000000003,0.19,0.22352941176470589,0,0.21,0.21,0.2,0.22000000000000003,0.18,0.19999999999999996,0.17,0.2,0,0.19,0.19,0.17,0.18000000000000002,0.16,0.16,0.16,0.18823529411764706,0]
[{"$f":"IF((AND(A32<$B$40,A34>$B$40)),$B$40,\"0,0\")","v":"0,0"},{"$f":"B34+((($A33-$A34)/($A32-$A34))*(B32-B34))","v":0.5299999999999998},0.5299999999999998,{"$f":"D34+((($A33-$A34)/($A32-$A34))*(D32-D34))","v":0.40999999999999992},0.43999999999999995,{"$f":"F34+((($A33-$A34)/($A32-$A34))*(F32-F34))","v":0.37999999999999989},0.57999999999999952,{"$f":"H34+((($A33-$A34)/($A32-$A34))*(H32-H34))","v":0.28000000000000008},0.32941176470588246,{"$f":"J34+((($A33-$A34)/($A32-$A34))*(J32-J34))","v":0},{"$f":"K34+((($A33-$A34)/($A32-$A34))*(K32-K34))","v":0.40999999999999992},0.40999999999999992,{"$f":"M34+((($A33-$A34)/($A32-$A34))*(M32-M34))","v":0.39000000000000012},0.50000000000000022,{"$f":"O34+((($A33-$A34)/($A32-$A34))*(O32-O34))","v":0.28000000000000008},0.3000000000000001,{"$f":"Q34+((($A33-$A34)/($A32-$A34))*(Q32-Q34))","v":0.27000000000000007},0.3176470588235295,{"$f":"S34+((($A33-$A34)/($A32-$A34))*(S32-S34))","v":0},{"$f":"T34+((($A33-$A34)/($A32-$A34))*(T32-T34))","v":0.28999999999999981},0.28999999999999981,{"$f":"V34+((($A33-$A34)/($A32-$A34))*(V32-V34))","v":0.36000000000000015},0.46000000000000046,{"$f":"X34+((($A33-$A34)/($A32-$A34))*(X32-X34))","v":0.25999999999999984},0.27999999999999931,{"$f":"Z34+((($A33-$A34)/($A32-$A34))*(Z32-Z34))","v":0.25000000000000011},0.29411764705882365,{"$f":"AB34+((($A33-$A34)/($A32-$A34))*(AB32-AB34))","v":0},{"$f":"AC34+((($A33-$A34)/($A32-$A34))*(AC32-AC34))","v":0.34999999999999992},0.34999999999999992,{"$f":"AE34+((($A33-$A34)/($A32-$A34))*(AE32-AE34))","v":0.25000000000000011},0.26000000000000012,{"$f":"AG34+((($A33-$A34)/($A32-$A34))*(AG32-AG34))","v":0.24000000000000007},0.24000000000000007,{"$f":"AI34+((($A33-$A34)/($A32-$A34))*(AI32-AI34))","v":0.24000000000000007},0.2823529411764707,{"$f":"AK34+((($A33-$A34)/($A32-$A34))*(AK32-AK34))","v":0}]
[18,0.26,0.26,0.23,0.26,0.2,0.22000000000000003,0.19,0.22352941176470589,0,0.23,0.23,0.21,0.22999999999999998,0.19,0.21000000000000002,0.18,0.21176470588235294,0,0.2,0.2,0.18,0.18999999999999997,0.17,0.19000000000000003,0.16,0.18823529411764706,0,0.17,0.17,0.16,0.17,0.15,0.15,0.15,0.1764705882352941,0]
[{"$f":"IF((AND(A34<$B$40,A36>$B$40)),$B$40,\"0,0\")","v":"0,0"},{"$f":"B36+((($A35-$A36)/($A34-$A36))*(B34-B36))","v":0.44000000000000017},0.44000000000000017,{"$f":"D36+((($A35-$A36)/($A34-$A36))*(D34-D36))","v":0.41000000000000014},0.53000000000000025,{"$f":"F36+((($A35-$A36)/($A34-$A36))*(F34-F36))","v":0.29000000000000009},0.1300000000000005,{"$f":"H36+((($A35-$A36)/($A34-$A36))*(H34-H36))","v":0.36999999999999988},0.43529411764705872,{"$f":"J36+((($A35-$A36)/($A34-$A36))*(J34-J36))","v":0},{"$f":"K36+((($A35-$A36)/($A34-$A36))*(K34-K36))","v":0.32000000000000006},0.32000000000000006,{"$f":"M36+((($A35-$A36)/($A34-$A36))*(M34-M36))","v":0.3899999999999999},0.49999999999999972,{"$f":"O36+((($A35-$A36)/($A34-$A36))*(O34-O36))","v":0.28000000000000008},0.1200000000000005,{"$f":"Q36+((($A35-$A36)/($A34-$A36))*(Q34-Q36))","v":0.35999999999999988},0.42352941176470571,{"$f":"S36+((($A35-$A36)/($A34-$A36))*(S34-S36))","v":0},{"$f":"T36+((($A35-$A36)/($A34-$A36))*(T34-T36))","v":0.38000000000000017},0.38000000000000017,{"$f":"V36+((($A35-$A36)/($A34-$A36))*(V34-V36))","v":0.2699999999999998},0.27999999999999947,{"$f":"X36+((($A35-$A36)/($A34-$A36))*(X34-X36))","v":0.26000000000000012},0.28000000000000014,{"$f":"Z36+((($A35-$A36)/($A34-$A36))*(Z34-Z36))","v":0.25000000000000011},0.29411764705882365,{"$f":"AB36+((($A35-$A36)/($A34-$A36))*(AB34-AB36))","v":0},{"$f":"AC36+((($A35-$A36)/($A34-$A36))*(AC34-AC36))","v":0.26000000000000012},0.26000000000000012,{"$f":"AE36+((($A35-$A36)/($A34-$A36))*(AE34-AE36))","v":0.25000000000000011},0.2600000000000004,{"$f":"AG36+((($A35-$A36)/($A34-$A36))*(AG34-AG36))","v":0.23999999999999982},0.23999999999999982,{"$f":"AI36+((($A35-$A36)/($A34-$A36))*(AI34-AI36))","v":0.23999999999999982},0.28235294117647036,{"$f":"AK36+((($A35-$A36)/($A34-$A36))*(AK34-AK36))","v":0}]
[20,0.24,0.24,0.21,0.22999999999999998,0.19,0.22999999999999998,0.17,0.2,0,0.22,0.22,0.19,0.2,0.18,0.21999999999999997,0.16,0.18823529411764706,0,0.18,0.18,0.17,0.18000000000000002,0.16,0.18000000000000002,0.15,0.1764705882352941,0,0.16,0.16,0.15,0.15999999999999998,0.14000000000000001,0.14000000000000001,0.14000000000000001,0.1647058823529412,0]
[{"$f":"IF((AND(A36<$B$40,A38>$B$40)),$B$40,\"0,0\")","v":"0,0"},{"$f":"B38+((($A37-$A38)/($A36-$A38))*(B36-B38))","v":0.24},0.24,{"$f":"D38+((($A37-$A38)/($A36-$A38))*(D36-D38))","v":0.21},0.22999999999999998,{"$f":"F38+((($A37-$A38)/($A36-$A38))*(F36-F38))","v":0.19},0.22999999999999998,{"$f":"H38+((($A37-$A38)/($A36-$A38))*(H36-H38))","v":0.17},0.2,{"$f":"J38+((($A37-$A38)/($A36-$A38))*(J36-J38))","v":0},{"$f":"K38+((($A37-$A38)/($A36-$A38))*(K36-K38))","v":0.22},0.22,{"$f":"M38+((($A37-$A38)/($A36-$A38))*(M36-M38))","v":0.19},0.2,{"$f":"O38+((($A37-$A38)/($A36-$A38))*(O36-O38))","v":0.18},0.21999999999999997,{"$f":"Q38+((($A37-$A38)/($A36-$A38))*(Q36-Q38))","v":0.16},0.18823529411764706,{"$f":"S38+((($A37-$A38)/($A36-$A38))*(S36-S38))","v":0},{"$f":"T38+((($A37-$A38)/($A36-$A38))*(T36-T38))","v":0.18},0.18,{"$f":"V38+((($A37-$A38)/($A36-$A38))*(V36-V38))","v":0.17},0.18000000000000002,{"$f":"X38+((($A37-$A38)/($A36-$A38))*(X36-X38))","v":0.16},0.18000000000000002,{"$f":"Z38+((($A37-$A38)/($A36-$A38))*(Z36-Z38))","v":0.15},0.1764705882352941,{"$f":"AB38+((($A37-$A38)/($A36-$A38))*(AB36-AB38))","v":0},{"$f":"AC38+((($A37-$A38)/($A36-$A38))*(AC36-AC38))","v":0.16},0.16,{"$f":"AE38+((($A37-$A38)/($A36-$A38))*(AE36-AE38))","v":0.15},0.15999999999999998,{"$f":"AG38+((($A37-$A38)/($A36-$A38))*(AG36-AG38))","v":0.14000000000000001},0.14000000000000001,{"$f":"AI38+((($A37-$A38)/($A36-$A38))*(AI36-AI38))","v":0.14000000000000001},0.1647058823529412,{"$f":"AK38+((($A37-$A38)/($A36-$A38))*(AK36-AK38))","v":0}]
[1000,{"$f":"B36","v":0.24},0.24,{"$f":"D36","v":0.21},0.22999999999999998,0.19,0.22999999999999998,0.17,0.2,0,0.22,0.22,0.19,0.2,0.18,0.21999999999999997,0.16,0.18823529411764706,0,0.18,0.18,0.17,0.18000000000000002,0.16,0.18000000000000002,0.15,0.1764705882352941,0,0.16,0.16,0.15,0.15999999999999998,0.14000000000000001,0.14000000000000001,0.14000000000000001,0.1647058823529412,0]
[]
["B'",{"$f":"IF(Cerramiento!G3=\"ESTIMADOS\",Auxiliar!AF31,'Datos necesarios'!H24)","v":""},null,"Rf",{"$f":"'Recop. Datos'!G18","v":0},1,"Us (0,5-1,0)",{"$f":"IFERROR((INDEX(B6:J38,MATCH(B40,A6:A38,0),MATCH(E40,B5:J5,0))),0)","v":0}]
[null,null,null,null,null,2,"Us (1,0-2,0)",{"$f":"IFERROR((INDEX(K6:S38,MATCH(B40,A6:A38,0),MATCH(E40,K5:S5,0))),0)","v":0}]
[null,null,null,null,null,3,"Us (2,0-3,0)",{"$f":"IFERROR((INDEX(T6:AB38,MATCH(B40,A6:A38,0),MATCH(E40,T5:AB5,0))),0)","v":0}]
[null,null,null,null,null,4,"Us (>3,0)",{"$f":"IFERROR((INDEX(AC6:AK38,MATCH(B40,A6:A38,0),MATCH(E40,AC5:AK5,0))),0)","v":0}]

{"sheet":"Tabla5","index":11,"n_rows":50,"n_cols":16,"rows_kept":50,"cut":false,"hidden":true,"merged":[[0,0,1,15],[2,4,3,12]]}
["Tabla 5. TRANSMITANCIA TÉRMICA DE MUROS ENTERRADOS UT [W/m²K]"]
[]
["Reducción",null,null,null,"Profundidad z de la parte enterrada del muro [m]"]
[0.3]
["Rm [m²\u0097K/ W]",0,{"$f":"IF((AND(B5<$E$50,D5>$E$50)),$E$50,\"0,00\")","v":"0,00"},0.5,{"$f":"IF((AND(D5<$E$50,F5>$E$50)),$E$50,\"0,00\")","v":"0,00"},1,{"$f":"IF((AND(F5<$E$50,H5>$E$50)),$E$50,\"0,00\")","v":"0,00"},2,{"$f":"IF((AND(H5<$E$50,J5>$E$50)),$E$50,\"0,00\")","v":"0,00"},3,{"$f":"IF((AND(J5<$E$50,L5>$E$50)),$E$50,\"0,00\")","v":"0,00"},4,{"$f":"IF((AND(L5<$E$50,N5>$E$50)),$E$50,\"0,00\")","v":"0,00"},6,{"$f":"IF((AND(N5<$E$50,P5>$E$50)),$E$50,\"0,00\")","v":"0,00"},1000]
[0,{"$f":"D6+(((B$5-D$5)/(F$5-D$5))*(F6-D6))","v":4.8},{"$f":"B6+(((C$5-B$5)/(D$5-B$5))*(D6-B6))","v":4.8},3.5,{"$f":"D6+(((E$5-D$5)/(F$5-D$5))*(F6-D6))","v":4.8},2.2000000000000002,2.9200000000000004,1.48,2.14,1.1499999999999999,1.7499999999999998,0.95,1.43,0.71,0.71,{"$f":"N6","v":0.71}]
[{"$f":"IF((AND(A6<$B$50,A8>$B$50)),$B$50,\"0,00\")","v":"0,00"},{"$f":"B8+((($A7-$A8)/($A6-$A8))*(B6-B8))","v":4.8},4.8,{"$f":"D8+((($A7-$A8)/($A6-$A8))*(D6-D8))","v":3.5},4.8,{"$f":"F8+((($A7-$A8)/($A6-$A8))*(F6-F8))","v":2.2000000000000002},2.9200000000000004,{"$f":"H8+((($A7-$A8)/($A6-$A8))*(H6-H8))","v":1.48},2.14,{"$f":"J8+((($A7-$A8)/($A6-$A8))*(J6-J8))","v":1.1499999999999999},1.7499999999999998,{"$f":"L8+((($A7-$A8)/($A6-$A8))*(L6-L8))","v":0.95},1.43,{"$f":"N8+((($A7-$A8)/($A6-$A8))*(N6-N8))","v":0.71},0.71,{"$f":"N7","v":0.71}]
[0.1,{"$f":"D8+(((B$5-D$5)/(F$5-D$5))*(F8-D8))","v":2.84},2.84,2.29,2.84,1.74,2.258,1.222,1.726,0.97,1.4499999999999997,0.81,1.1900000000000002,0.62,0.62,0.62]
[{"$f":"IF((AND(A8<$B$50,A10>$B$50)),$B$50,\"0,00\")","v":"0,00"},{"$f":"B10+((($A9-$A10)/($A8-$A10))*(B8-B10))","v":3.4499999999999993},3.4499999999999993,{"$f":"D10+((($A9-$A10)/($A8-$A10))*(D8-D10))","v":2.74},3.45,{"$f":"F10+((($A9-$A10)/($A8-$A10))*(F8-F10))","v":2.0300000000000002},2.6760000000000006,{"$f":"H10+((($A9-$A10)/($A8-$A10))*(H8-H10))","v":1.3839999999999999},1.972,{"$f":"J10+((($A9-$A10)/($A8-$A10))*(J8-J10))","v":1.0899999999999999},1.659999999999999,{"$f":"L10+((($A9-$A10)/($A8-$A10))*(L8-L10))","v":0.90000000000000013},1.3400000000000005,{"$f":"N10+((($A9-$A10)/($A8-$A10))*(N8-N10))","v":0.67999999999999994},0.67999999999999994,0.67999999999999994]
[0.2,{"$f":"D10+(((B$5-D$5)/(F$5-D$5))*(F10-D10))","v":2.2300000000000004},2.2300000000000004,1.84,2.2300000000000004,1.45,1.8399999999999999,1.06,1.4800000000000002,0.85,1.24,0.72,1.0399999999999998,0.56000000000000005,0.56000000000000005,0.56000000000000005]
[{"$f":"IF((AND(A10<$B$50,A12>$B$50)),$B$50,\"0,00\")","v":"0,00"},{"$f":"B12+((($A11-$A12)/($A10-$A12))*(B10-B12))","v":2.9900000000000011},2.9900000000000011,{"$f":"D12+((($A11-$A12)/($A10-$A12))*(D10-D12))","v":2.4200000000000004},2.9900000000000007,{"$f":"F12+((($A11-$A12)/($A10-$A12))*(F10-F12))","v":1.85},2.38,{"$f":"H12+((($A11-$A12)/($A10-$A12))*(H10-H12))","v":1.32},1.9000000000000001,{"$f":"J12+((($A11-$A12)/($A10-$A12))*(J10-J12))","v":1.03},1.5400000000000005,{"$f":"L12+((($A11-$A12)/($A10-$A12))*(L10-L12))","v":0.85999999999999988},1.2599999999999993,{"$f":"N12+((($A11-$A12)/($A10-$A12))*(N10-N12))","v":0.66000000000000014},0.66000000000000014,0.66000000000000014]
[0.3,{"$f":"D12+(((B$5-D$5)/(F$5-D$5))*(F12-D12))","v":1.85},1.85,1.55,1.85,1.25,1.5699999999999998,0.93,1.27,0.76,1.0899999999999999,0.65,0.93,0.51,0.51,0.51]
[{"$f":"IF((AND(A12<$B$50,A14>$B$50)),$B$50,\"0,00\")","v":"0,00"},{"$f":"B14+((($A13-$A14)/($A12-$A14))*(B12-B14))","v":2.7199999999999998},2.7199999999999998,{"$f":"D14+((($A13-$A14)/($A12-$A14))*(D12-D14))","v":2.21},2.72,{"$f":"F14+((($A13-$A14)/($A12-$A14))*(F12-F14))","v":1.6999999999999997},2.1999999999999993,{"$f":"H14+((($A13-$A14)/($A12-$A14))*(H12-H14))","v":1.2000000000000002},1.6600000000000001,{"$f":"J14+((($A13-$A14)/($A12-$A14))*(J12-J14))","v":0.9700000000000002},1.4800000000000006,{"$f":"L14+((($A13-$A14)/($A12-$A14))*(L12-L14))","v":0.8},1.1399999999999999,{"$f":"N14+((($A13-$A14)/($A12-$A14))*(N12-N14))","v":0.63000000000000012},0.63000000000000012,0.63000000000000012]
[0.4,{"$f":"D14+(((B$5-D$5)/(F$5-D$5))*(F14-D14))","v":1.56},1.56,1.33,1.56,1.1000000000000001,1.3600000000000003,0.84,1.1400000000000001,0.69,0.95999999999999985,0.6,0.86,0.47,0.47,0.47]
[{"$f":"IF((AND(A14<$B$50,A16>$B$50)),$B$50,\"0,00\")","v":"0,00"},{"$f":"B16+((($A15-$A16)/($A14-$A16))*(B14-B16))","v":2.4000000000000012},2.4000000000000012,{"$f":"D16+((($A15-$A16)/($A14-$A16))*(D14-D16))","v":1.9700000000000006},2.4000000000000008,{"$f":"F16+((($A15-$A16)/($A14-$A16))*(F14-F16))","v":1.5400000000000005},1.9600000000000011,{"$f":"H16+((($A15-$A16)/($A14-$A16))*(H14-H16))","v":1.1199999999999999},1.5800000000000003,{"$f":"J16+((($A15-$A16)/($A14-$A16))*(J14-J16))","v":0.88999999999999968},1.1599999999999993,{"$f":"L16+((($A15-$A16)/($A14-$A16))*(L14-L16))","v":0.79999999999999982},1.2199999999999998,{"$f":"N16+((($A15-$A16)/($A14-$A16))*(N14-N16))","v":0.58999999999999986},0.58999999999999986,0.58999999999999986]
[0.5,{"$f":"D16+(((B$5-D$5)/(F$5-D$5))*(F16-D16))","v":1.3499999999999999},1.3499999999999999,1.17,1.3499999999999999,0.99,1.21,0.77,1.03,0.64,0.90999999999999992,0.55000000000000004,0.77000000000000013,0.44,0.44,0.44]
[{"$f":"IF((AND(A16<$B$50,A18>$B$50)),$B$50,\"0,00\")","v":"0,00"},{"$f":"B18+((($A17-$A18)/($A16-$A18))*(B16-B18))","v":2.0999999999999983},2.0999999999999983,{"$f":"D18+((($A17-$A18)/($A16-$A18))*(D16-D18))","v":1.7699999999999996},2.0999999999999992,{"$f":"F18+((($A17-$A18)/($A16-$A18))*(F16-F18))","v":1.44},1.8099999999999996,{"$f":"H18+((($A17-$A18)/($A16-$A18))*(H16-H18))","v":1.0700000000000003},1.4300000000000002,{"$f":"J18+((($A17-$A18)/($A16-$A18))*(J16-J18))","v":0.89000000000000035},1.4600000000000009,{"$f":"L18+((($A17-$A18)/($A16-$A18))*(L16-L18))","v":0.70000000000000018},1.0200000000000002,{"$f":"N18+((($A17-$A18)/($A16-$A18))*(N16-N18))","v":0.54000000000000015},0.54000000000000015,0.54000000000000015]
[0.6,{"$f":"D18+(((B$5-D$5)/(F$5-D$5))*(F18-D18))","v":1.2000000000000002},1.2000000000000002,1.05,1.2000000000000002,0.9,1.0900000000000001,0.71,0.95,0.59,0.79999999999999982,0.52,0.72000000000000008,0.42,0.42,0.42]
[{"$f":"IF((AND(A18<$B$50,A20>$B$50)),$B$50,\"0,00\")","v":"0,00"},{"$f":"B20+((($A19-$A20)/($A18-$A20))*(B18-B20))","v":1.9200000000000008},1.9200000000000008,{"$f":"D20+((($A19-$A20)/($A18-$A20))*(D18-D20))","v":1.6500000000000008},1.920000000000001,{"$f":"F20+((($A19-$A20)/($A18-$A20))*(F18-F20))","v":1.3800000000000006},1.7500000000000016,{"$f":"H20+((($A19-$A20)/($A18-$A20))*(H18-H20))","v":1.0099999999999996},1.4899999999999998,{"$f":"J20+((($A19-$A20)/($A18-$A20))*(J18-J20))","v":0.76999999999999946},0.97999999999999732,{"$f":"L20+((($A19-$A20)/($A18-$A20))*(L18-L20))","v":0.70000000000000018},0.9000000000000008,{"$f":"N20+((($A19-$A20)/($A18-$A20))*(N18-N20))","v":0.59999999999999987},0.59999999999999987,0.59999999999999987]
[0.7,{"$f":"D20+(((B$5-D$5)/(F$5-D$5))*(F20-D20))","v":1.08},1.08,0.95,1.08,0.82,0.97999999999999987,0.66,0.86,0.56000000000000005,0.77000000000000024,0.49,0.69,0.39,0.39,0.39]
[{"$f":"IF((AND(A20<$B$50,A22>$B$50)),$B$50,\"0,00\")","v":"0,00"},{"$f":"B22+((($A21-$A22)/($A20-$A22))*(B20-B22))","v":1.78},1.78,{"$f":"D22+((($A21-$A22)/($A20-$A22))*(D20-D22))","v":1.5099999999999991},1.7799999999999991,{"$f":"F22+((($A21-$A22)/($A20-$A22))*(F20-F22))","v":1.2399999999999991},1.4699999999999982,{"$f":"H22+((($A21-$A22)/($A20-$A22))*(H20-H22))","v":1.01},1.3499999999999999,{"$f":"J22+((($A21-$A22)/($A20-$A22))*(J20-J22))","v":0.84000000000000008},1.2600000000000018,{"$f":"L22+((($A21-$A22)/($A20-$A22))*(L20-L22))","v":0.69999999999999951},1.1799999999999984,{"$f":"N22+((($A21-$A22)/($A20-$A22))*(N20-N22))","v":0.46},0.46,0.46]
[0.8,{"$f":"D22+(((B$5-D$5)/(F$5-D$5))*(F22-D22))","v":0.98},0.98,0.87,0.98,0.76,0.91,0.61,0.78999999999999992,0.52,0.7,0.46,0.62000000000000011,0.38,0.38,0.38]
[{"$f":"IF((AND(A22<$B$50,A24>$B$50)),$B$50,\"0,00\")","v":"0,00"},{"$f":"B24+((($A23-$A24)/($A22-$A24))*(B22-B24))","v":1.6199999999999988},1.6199999999999988,{"$f":"D24+((($A23-$A24)/($A22-$A24))*(D22-D24))","v":1.4299999999999997},1.6199999999999988,{"$f":"F24+((($A23-$A24)/($A22-$A24))*(F22-F24))","v":1.2400000000000007},1.630000000000001,{"$f":"H24+((($A23-$A24)/($A22-$A24))*(H22-H24))","v":0.85000000000000031},1.0300000000000005,{"$f":"J24+((($A23-$A24)/($A22-$A24))*(J22-J24))","v":0.76000000000000023},1.1800000000000002,{"$f":"L24+((($A23-$A24)/($A22-$A24))*(L22-L24))","v":0.62000000000000022},0.78000000000000036,{"$f":"N24+((($A23-$A24)/($A22-$A24))*(N22-N24))","v":0.54000000000000015},0.54000000000000015,0.54000000000000015]
[0.9,{"$f":"D24+(((B$5-D$5)/(F$5-D$5))*(F24-D24))","v":0.90000000000000013},0.90000000000000013,0.8,0.90000000000000013,0.7,0.82,0.57999999999999996,0.7599999999999999,0.49,0.6399999999999999,0.44,0.60000000000000009,0.36,0.36,0.36]
[{"$f":"IF((AND(A24<$B$50,A26>$B$50)),$B$50,\"0,00\")","v":"0,00"},{"$f":"B26+((($A25-$A26)/($A24-$A26))*(B24-B26))","v":6.3900000000000032},6.3900000000000032,{"$f":"D26+((($A25-$A26)/($A24-$A26))*(D24-D26))","v":3.7700000000000014},6.3900000000000032,{"$f":"F26+((($A25-$A26)/($A24-$A26))*(F24-F26))","v":1.1499999999999995},1.3599999999999997,{"$f":"H26+((($A25-$A26)/($A24-$A26))*(H24-H26))","v":0.93999999999999928},1.4799999999999975,{"$f":"J26+((($A25-$A26)/($A24-$A26))*(J24-J26))","v":0.67000000000000015},0.82,{"$f":"L26+((($A25-$A26)/($A24-$A26))*(L24-L26))","v":0.62000000000000022},0.78000000000000125,{"$f":"N26+((($A25-$A26)/($A24-$A26))*(N24-N26))","v":0.5399999999999997},0.5399999999999997,0.5399999999999997]
[1,{"$f":"D26+(((B$5-D$5)/(F$5-D$5))*(F26-D26))","v":0.28999999999999992},0.28999999999999992,0.47,0.28999999999999992,0.65,0.76,0.54,0.68000000000000016,0.47,0.61999999999999988,0.42,0.57999999999999985,0.34,0.34,0.34]
[{"$f":"IF((AND(A26<$B$50,A28>$B$50)),$B$50,\"0,00\")","v":"0,00"},{"$f":"B28+((($A27-$A28)/($A26-$A28))*(B26-B28))","v":-4.5099999999999962},-4.5099999999999962,{"$f":"D28+((($A27-$A28)/($A26-$A28))*(D26-D28))","v":-1.7299999999999978},-4.5099999999999953,{"$f":"F28+((($A27-$A28)/($A26-$A28))*(F26-F28))","v":1.05},1.26,{"$f":"H28+((($A27-$A28)/($A26-$A28))*(H26-H28))","v":0.84000000000000008},1.1800000000000013,{"$f":"J28+((($A27-$A28)/($A26-$A28))*(J26-J28))","v":0.66999999999999948},0.81999999999999962,{"$f":"L28+((($A27-$A28)/($A26-$A28))*(L26-L28))","v":0.61999999999999944},0.97999999999999821,{"$f":"N28+((($A27-$A28)/($A26-$A28))*(N26-N28))","v":0.44000000000000006},0.44000000000000006,0.44000000000000006]
[1.1000000000000001,{"$f":"D28+(((B$5-D$5)/(F$5-D$5))*(F28-D28))","v":0.76999999999999991},0.76999999999999991,0.69,0.76999999999999991,0.61,0.71,0.51,0.63,0.45,0.6,0.4,0.54,0.33,0.33,0.33]
[{"$f":"IF((AND(A28<$B$50,A30>$B$50)),$B$50,\"0,00\")","v":"0,00"},{"$f":"B30+((($A29-$A30)/($A28-$A30))*(B28-B30))","v":1.5399999999999991},1.5399999999999991,{"$f":"D30+((($A29-$A30)/($A28-$A30))*(D28-D30))","v":1.24},1.5399999999999991,{"$f":"F30+((($A29-$A30)/($A28-$A30))*(F28-F30))","v":0.94000000000000083},1.1500000000000012,{"$f":"H30+((($A29-$A30)/($A28-$A30))*(H28-H30))","v":0.73000000000000054},0.63,{"$f":"J30+((($A29-$A30)/($A28-$A30))*(J28-J30))","v":0.7800000000000008},1.2600000000000016,{"$f":"L30+((($A29-$A30)/($A28-$A30))*(L28-L30))","v":0.62000000000000055},0.98000000000000109,{"$f":"N30+((($A29-$A30)/($A28-$A30))*(N28-N30))","v":0.44000000000000028},0.44000000000000028,0.44000000000000028]
[1.2,{"$f":"D30+(((B$5-D$5)/(F$5-D$5))*(F30-D30))","v":0.70000000000000007},0.70000000000000007,0.64,0.70000000000000007,0.57999999999999996,0.66999999999999993,0.49,0.63,0.42,0.53999999999999992,0.38,0.5,0.32,0.32,0.32]
[{"$f":"IF((AND(A30<$B$50,A32>$B$50)),$B$50,\"0,00\")","v":"0,00"},{"$f":"B32+((($A31-$A32)/($A30-$A32))*(B30-B32))","v":1.3000000000000014},1.3000000000000014,{"$f":"D32+((($A31-$A32)/($A30-$A32))*(D30-D32))","v":1.1200000000000001},1.3000000000000016,{"$f":"F32+((($A31-$A32)/($A30-$A32))*(F30-F32))","v":0.93999999999999861},1.029999999999998,{"$f":"H32+((($A31-$A32)/($A30-$A32))*(H30-H32))","v":0.84999999999999931},1.469999999999998,{"$f":"J32+((($A31-$A32)/($A30-$A32))*(J30-J32))","v":0.54},0.30000000000000016,{"$f":"L32+((($A31-$A32)/($A30-$A32))*(L30-L32))","v":0.62},0.73999999999999988,{"$f":"N32+((($A31-$A32)/($A30-$A32))*(N30-N32))","v":0.56000000000000005},0.56000000000000005,0.56000000000000005]
[1.3,{"$f":"D32+(((B$5-D$5)/(F$5-D$5))*(F32-D32))","v":0.64999999999999991},0.64999999999999991,0.6,0.64999999999999991,0.55000000000000004,0.64000000000000012,0.46,0.56000000000000005,0.41,0.55999999999999994,0.36,0.48,0.3,0.3,0.3]
[{"$f":"IF((AND(A32<$B$50,A34>$B$50)),$B$50,\"0,00\")","v":"0,00"},{"$f":"B34+((($A33-$A34)/($A32-$A34))*(B32-B34))","v":1.0400000000000009},1.0400000000000009,{"$f":"D34+((($A33-$A34)/($A32-$A34))*(D32-D34))","v":0.99000000000000088},1.0400000000000009,{"$f":"F34+((($A33-$A34)/($A32-$A34))*(F32-F34))","v":0.94000000000000095},1.1600000000000013,{"$f":"H34+((($A33-$A34)/($A32-$A34))*(H32-H34))","v":0.72000000000000064},0.82000000000000228,{"$f":"J34+((($A33-$A34)/($A32-$A34))*(J32-J34))","v":0.66999999999999982},1.2099999999999986,{"$f":"L34+((($A33-$A34)/($A32-$A34))*(L32-L34))","v":0.49000000000000027},0.61000000000000032,{"$f":"N34+((($A33-$A34)/($A32-$A34))*(N32-N34))","v":0.43000000000000027},0.43000000000000027,0.43000000000000027]
[1.4,{"$f":"D34+(((B$5-D$5)/(F$5-D$5))*(F34-D34))","v":0.61999999999999988},0.61999999999999988,0.56999999999999995,0.61999999999999988,0.52,0.60000000000000009,0.44,0.54,0.39,0.51000000000000012,0.35,0.47,0.28999999999999998,0.28999999999999998,0.28999999999999998]
[{"$f":"IF((AND(A34<$B$50,A36>$B$50)),$B$50,\"0,00\")","v":"0,00"},{"$f":"B36+((($A35-$A36)/($A34-$A36))*(B34-B36))","v":1.0399999999999967},1.0399999999999967,{"$f":"D36+((($A35-$A36)/($A34-$A36))*(D34-D36))","v":0.98999999999999833},1.0399999999999967,{"$f":"F36+((($A35-$A36)/($A34-$A36))*(F34-F36))","v":0.94},1.1599999999999999,{"$f":"H36+((($A35-$A36)/($A34-$A36))*(H34-H36))","v":0.72},0.82000000000000006,{"$f":"J36+((($A35-$A36)/($A34-$A36))*(J34-J36))","v":0.66999999999999993},1.2100000000000022,{"$f":"L36+((($A35-$A36)/($A34-$A36))*(L34-L36))","v":0.48999999999999921},0.60999999999999932,{"$f":"N36+((($A35-$A36)/($A34-$A36))*(N34-N36))","v":0.42999999999999916},0.42999999999999916,0.42999999999999916]
[1.5,{"$f":"D36+(((B$5-D$5)/(F$5-D$5))*(F36-D36))","v":0.59000000000000008},0.59000000000000008,0.54,0.59000000000000008,0.49,0.56000000000000005,0.42,0.52,0.37,0.45999999999999991,0.34,0.46,0.28000000000000003,0.28000000000000003,0.28000000000000003]
[{"$f":"IF((AND(A36<$B$50,A38>$B$50)),$B$50,\"0,00\")","v":"0,00"},{"$f":"B38+((($A37-$A38)/($A36-$A38))*(B36-B38))","v":1.19},1.19,{"$f":"D38+((($A37-$A38)/($A36-$A38))*(D36-D38))","v":0.99},1.19,{"$f":"F38+((($A37-$A38)/($A36-$A38))*(F36-F38))","v":0.79},0.86000000000000099,{"$f":"H38+((($A37-$A38)/($A36-$A38))*(H36-H38))","v":0.71999999999999909},1.1199999999999972,{"$f":"J38+((($A37-$A38)/($A36-$A38))*(J36-J38))","v":0.52},0.16000000000000003,{"$f":"L38+((($A37-$A38)/($A36-$A38))*(L36-L38))","v":0.64},1.3599999999999999,{"$f":"N38+((($A37-$A38)/($A36-$A38))*(N36-N38))","v":0.28000000000000003},0.28000000000000003,0.28000000000000003]
[1.6,{"$f":"D38+(((B$5-D$5)/(F$5-D$5))*(F38-D38))","v":0.55000000000000004},0.55000000000000004,0.51,0.55000000000000004,0.47,0.53999999999999992,0.4,0.48000000000000009,0.36,0.47999999999999993,0.32,0.39999999999999997,0.28000000000000003,0.28000000000000003,0.28000000000000003]
[{"$f":"IF((AND(A38<$B$50,A40>$B$50)),$B$50,\"0,00\")","v":"0,00"},{"$f":"B40+((($A39-$A40)/($A38-$A40))*(B38-B40))","v":0.87000000000000077},0.87000000000000077,{"$f":"D40+((($A39-$A40)/($A38-$A40))*(D38-D40))","v":0.83000000000000074},0.87000000000000166,{"$f":"F40+((($A39-$A40)/($A38-$A40))*(F38-F40))","v":0.78999999999999981},1.0199999999999991,{"$f":"H40+((($A39-$A40)/($A38-$A40))*(H38-H40))","v":0.56000000000000039},0.64000000000000046,{"$f":"J40+((($A39-$A40)/($A38-$A40))*(J38-J40))","v":0.52000000000000035},0.64000000000000035,{"$f":"L40+((($A39-$A40)/($A38-$A40))*(L38-L40))","v":0.48000000000000037},0.56000000000000028,{"$f":"N40+((($A39-$A40)/($A38-$A40))*(N38-N40))","v":0.44000000000000039},0.44000000000000039,0.44000000000000039]
[1.7,{"$f":"D40+(((B$5-D$5)/(F$5-D$5))*(F40-D40))","v":0.53},0.53,0.49,0.53,0.45,0.51,0.39,0.47000000000000008,0.35,0.46999999999999992,0.31,0.38999999999999996,0.27,0.27,0.27]
[{"$f":"IF((AND(A40<$B$50,A42>$B$50)),$B$50,\"0,00\")","v":"0,00"},{"$f":"B42+((($A41-$A42)/($A40-$A42))*(B40-B42))","v":1.2099999999999991},1.2099999999999991,{"$f":"D42+((($A41-$A42)/($A40-$A42))*(D40-D42))","v":0.99999999999999911},1.2099999999999982,{"$f":"F42+((($A41-$A42)/($A40-$A42))*(F40-F42))","v":0.79},0.85000000000000009,{"$f":"H42+((($A41-$A42)/($A40-$A42))*(H40-H42))","v":0.73},0.81000000000000183,{"$f":"J42+((($A41-$A42)/($A40-$A42))*(J40-J42))","v":0.68999999999999906},1.3199999999999963,{"$f":"L42+((($A41-$A42)/($A40-$A42))*(L40-L42))","v":0.48},0.55999999999999983,{"$f":"N42+((($A41-$A42)/($A40-$A42))*(N40-N42))","v":0.44000000000000006},0.44000000000000006,0.44000000000000006]
[1.8,{"$f":"D42+(((B$5-D$5)/(F$5-D$5))*(F42-D42))","v":0.49000000000000005},0.49000000000000005,0.46,0.49000000000000005,0.43,0.49,0.37,0.44999999999999996,0.33,0.4200000000000001,0.3,0.37999999999999995,0.26,0.26,0.26]
[{"$f":"IF((AND(A42<$B$50,A44>$B$50)),$B$50,\"0,00\")","v":"0,00"},{"$f":"B44+((($A43-$A44)/($A42-$A44))*(B42-B44))","v":0.85000000000000087},0.85000000000000087,{"$f":"D44+((($A43-$A44)/($A42-$A44))*(D42-D44))","v":0.82000000000000084},0.85000000000000087,{"$f":"F44+((($A43-$A44)/($A42-$A44))*(F42-F44))","v":0.79000000000000081},1.0300000000000011,{"$f":"H44+((($A43-$A44)/($A42-$A44))*(H42-H44))","v":0.55000000000000038},0.63000000000000023,{"$f":"J44+((($A43-$A44)/($A42-$A44))*(J42-J44))","v":0.51000000000000045},0.60000000000000053,{"$f":"L44+((($A43-$A44)/($A42-$A44))*(L42-L44))","v":0.48000000000000043},0.5600000000000005,{"$f":"N44+((($A43-$A44)/($A42-$A44))*(N42-N44))","v":0.44000000000000039},0.44000000000000039,0.44000000000000039]
[1.9,{"$f":"D44+(((B$5-D$5)/(F$5-D$5))*(F44-D44))","v":0.47000000000000003},0.47000000000000003,0.44,0.47000000000000003,0.41,0.45999999999999996,0.36,0.43999999999999995,0.32,0.41000000000000009,0.28999999999999998,0.36999999999999994,0.25,0.25,0.25]
[{"$f":"IF((AND(A44<$B$50,A46>$B$50)),$B$50,\"0,00\")","v":"0,00"},{"$f":"B46+((($A45-$A46)/($A44-$A46))*(B44-B46))","v":0.85000000000000109},0.85000000000000109,{"$f":"D46+((($A45-$A46)/($A44-$A46))*(D44-D46))","v":0.82000000000000006},0.8500000000000012,{"$f":"F46+((($A45-$A46)/($A44-$A46))*(F44-F46))","v":0.78999999999999893},1.0299999999999978,{"$f":"H46+((($A45-$A46)/($A44-$A46))*(H44-H46))","v":0.55000000000000004},0.63000000000000012,{"$f":"J46+((($A45-$A46)/($A44-$A46))*(J44-J46))","v":0.51},0.6000000000000032,{"$f":"L46+((($A45-$A46)/($A44-$A46))*(L44-L46))","v":0.47999999999999893},0.55999999999999672,{"$f":"N46+((($A45-$A46)/($A44-$A46))*(N44-N46))","v":0.44},0.44,0.44]
[2,{"$f":"D46+(((B$5-D$5)/(F$5-D$5))*(F46-D46))","v":0.44999999999999996},0.44999999999999996,0.42,0.44999999999999996,0.39,0.43000000000000005,0.35,0.42999999999999994,0.31,0.39999999999999991,0.28000000000000003,0.3600000000000001,0.24,{"$f":"N46+(((O$5-N$5)/(P$5-N$5))*(P46-N46))","v":0.24},0.24]
[{"$f":"IF((AND(A46<$B$50,A48>$B$50)),$B$50,\"0,00\")","v":"0,00"},{"$f":"B48+((($A47-$A48)/($A46-$A48))*(B46-B48))","v":0.48374999999999996},0.48374999999999996,{"$f":"D48+((($A47-$A48)/($A46-$A48))*(D46-D48))","v":0.45150000000000001},0.48375000000000001,{"$f":"F48+((($A47-$A48)/($A46-$A48))*(F46-F48))","v":0.41925000000000001},0.46225000000000005,{"$f":"H48+((($A47-$A48)/($A46-$A48))*(H46-H48))","v":0.37624999999999997},0.46224999999999994,{"$f":"J48+((($A47-$A48)/($A46-$A48))*(J46-J48))","v":0.33324999999999999},0.42999999999999983,{"$f":"L48+((($A47-$A48)/($A46-$A48))*(L46-L48))","v":0.30100000000000005},0.38700000000000012,{"$f":"N48+((($A47-$A48)/($A46-$A48))*(N46-N48))","v":0.25800000000000001},0.25800000000000001,0.25800000000000001]
[10,{"$f":"D48+(((B$5-D$5)/(F$5-D$5))*(F48-D48))","v":0.315},0.315,{"$f":"D46*(1-$A$4)","v":0.29399999999999998},0.315,{"$f":"F46*(1-$A$4)","v":0.27299999999999996},0.30099999999999993,{"$f":"H46*(1-$A$4)","v":0.24499999999999997},0.30099999999999993,{"$f":"J46*(1-$A$4)","v":0.217},0.27999999999999997,{"$f":"L46*(1-$A$4)","v":0.19600000000000001},0.25200000000000006,{"$f":"N46*(1-$A$4)","v":0.16799999999999998},0.16799999999999998,0.16799999999999998]
[]
["Rm",{"$f":"'Recop. Datos'!D18","v":0},null,"z",{"$f":"IF(Cerramiento!G3=\"ESTIMADOS\",Auxiliar!AF34,'Datos necesarios'!$R$35)","v":0},null,"UT",{"$f":"IFERROR((INDEX(B6:P48,MATCH(B50,A6:A48,0),MATCH(E50,B5:P5,0))),0)","v":4.8}]

{"sheet":"Tabla5V","index":12,"n_rows":50,"n_cols":16,"rows_kept":50,"cut":false,"hidden":true,"merged":[[0,0,1,15],[2,4,3,12]]}
["Tabla 5. TRANSMITANCIA TÉRMICA DE MUROS ENTERRADOS UT [W/m²K]"]
[]
["Reducción",null,null,null,"Profundidad z de la parte enterrada del muro [m]"]
[0.3]
["Rm [m²\u0097K/ W]",0,{"$f":"IF((AND(B5<$E$50,D5>$E$50)),$E$50,\"0,00\")","v":"0,00"},0.5,{"$f":"IF((AND(D5<$E$50,F5>$E$50)),$E$50,\"0,00\")","v":"0,00"},1,{"$f":"IF((AND(F5<$E$50,H5>$E$50)),$E$50,\"0,00\")","v":"0,00"},2,{"$f":"IF((AND(H5<$E$50,J5>$E$50)),$E$50,\"0,00\")","v":"0,00"},3,{"$f":"IF((AND(J5<$E$50,L5>$E$50)),$E$50,\"0,00\")","v":"0,00"},4,{"$f":"IF((AND(L5<$E$50,N5>$E$50)),$E$50,\"0,00\")","v":"0,00"},6,{"$f":"IF((AND(N5<$E$50,P5>$E$50)),$E$50,\"0,00\")","v":"0,00"},1000]
[0,{"$f":"D6+(((B$5-D$5)/(F$5-D$5))*(F6-D6))","v":4.8},{"$f":"B6+(((C$5-B$5)/(D$5-B$5))*(D6-B6))","v":4.8},3.5,{"$f":"D6+(((E$5-D$5)/(F$5-D$5))*(F6-D6))","v":4.8},2.2000000000000002,2.9200000000000004,1.48,2.14,1.1499999999999999,1.7499999999999998,0.95,1.43,0.71,0.71,{"$f":"N6","v":0.71}]
[{"$f":"IF((AND(A6<$B$50,A8>$B$50)),$B$50,\"0,00\")","v":"0,00"},{"$f":"B8+((($A7-$A8)/($A6-$A8))*(B6-B8))","v":4.8},4.8,{"$f":"D8+((($A7-$A8)/($A6-$A8))*(D6-D8))","v":3.5},4.8,{"$f":"F8+((($A7-$A8)/($A6-$A8))*(F6-F8))","v":2.2000000000000002},2.9200000000000004,{"$f":"H8+((($A7-$A8)/($A6-$A8))*(H6-H8))","v":1.48},2.14,{"$f":"J8+((($A7-$A8)/($A6-$A8))*(J6-J8))","v":1.1499999999999999},1.7499999999999998,{"$f":"L8+((($A7-$A8)/($A6-$A8))*(L6-L8))","v":0.95},1.43,{"$f":"N8+((($A7-$A8)/($A6-$A8))*(N6-N8))","v":0.71},0.71,{"$f":"N7","v":0.71}]
[0.1,{"$f":"D8+(((B$5-D$5)/(F$5-D$5))*(F8-D8))","v":2.84},2.84,2.29,2.84,1.74,2.258,1.222,1.726,0.97,1.4499999999999997,0.81,1.1900000000000002,0.62,0.62,0.62]
[{"$f":"IF((AND(A8<$B$50,A10>$B$50)),$B$50,\"0,00\")","v":"0,00"},{"$f":"B10+((($A9-$A10)/($A8-$A10))*(B8-B10))","v":3.4499999999999993},3.4499999999999993,{"$f":"D10+((($A9-$A10)/($A8-$A10))*(D8-D10))","v":2.74},3.45,{"$f":"F10+((($A9-$A10)/($A8-$A10))*(F8-F10))","v":2.0300000000000002},2.6760000000000006,{"$f":"H10+((($A9-$A10)/($A8-$A10))*(H8-H10))","v":1.3839999999999999},1.972,{"$f":"J10+((($A9-$A10)/($A8-$A10))*(J8-J10))","v":1.0899999999999999},1.659999999999999,{"$f":"L10+((($A9-$A10)/($A8-$A10))*(L8-L10))","v":0.90000000000000013},1.3400000000000005,{"$f":"N10+((($A9-$A10)/($A8-$A10))*(N8-N10))","v":0.67999999999999994},0.67999999999999994,0.67999999999999994]
[0.2,{"$f":"D10+(((B$5-D$5)/(F$5-D$5))*(F10-D10))","v":2.2300000000000004},2.2300000000000004,1.84,2.2300000000000004,1.45,1.8399999999999999,1.06,1.4800000000000002,0.85,1.24,0.72,1.0399999999999998,0.56000000000000005,0.56000000000000005,0.56000000000000005]
[{"$f":"IF((AND(A10<$B$50,A12>$B$50)),$B$50,\"0,00\")","v":"0,00"},{"$f":"B12+((($A11-$A12)/($A10-$A12))*(B10-B12))","v":2.9900000000000011},2.9900000000000011,{"$f":"D12+((($A11-$A12)/($A10-$A12))*(D10-D12))","v":2.4200000000000004},2.9900000000000007,{"$f":"F12+((($A11-$A12)/($A10-$A12))*(F10-F12))","v":1.85},2.38,{"$f":"H12+((($A11-$A12)/($A10-$A12))*(H10-H12))","v":1.32},1.9000000000000001,{"$f":"J12+((($A11-$A12)/($A10-$A12))*(J10-J12))","v":1.03},1.5400000000000005,{"$f":"L12+((($A11-$A12)/($A10-$A12))*(L10-L12))","v":0.85999999999999988},1.2599999999999993,{"$f":"N12+((($A11-$A12)/($A10-$A12))*(N10-N12))","v":0.66000000000000014},0.66000000000000014,0.66000000000000014]
[0.3,{"$f":"D12+(((B$5-D$5)/(F$5-D$5))*(F12-D12))","v":1.85},1.85,1.55,1.85,1.25,1.5699999999999998,0.93,1.27,0.76,1.0899999999999999,0.65,0.93,0.51,0.51,0.51]
[{"$f":"IF((AND(A12<$B$50,A14>$B$50)),$B$50,\"0,00\")","v":"0,00"},{"$f":"B14+((($A13-$A14)/($A12-$A14))*(B12-B14))","v":2.7199999999999998},2.7199999999999998,{"$f":"D14+((($A13-$A14)/($A12-$A14))*(D12-D14))","v":2.21},2.72,{"$f":"F14+((($A13-$A14)/($A12-$A14))*(F12-F14))","v":1.6999999999999997},2.1999999999999993,{"$f":"H14+((($A13-$A14)/($A12-$A14))*(H12-H14))","v":1.2000000000000002},1.6600000000000001,{"$f":"J14+((($A13-$A14)/($A12-$A14))*(J12-J14))","v":0.9700000000000002},1.4800000000000006,{"$f":"L14+((($A13-$A14)/($A12-$A14))*(L12-L14))","v":0.8},1.1399999999999999,{"$f":"N14+((($A13-$A14)/($A12-$A14))*(N12-N14))","v":0.63000000000000012},0.63000000000000012,0.63000000000000012]
[0.4,{"$f":"D14+(((B$5-D$5)/(F$5-D$5))*(F14-D14))","v":1.56},1.56,1.33,1.56,1.1000000000000001,1.3600000000000003,0.84,1.1400000000000001,0.69,0.95999999999999985,0.6,0.86,0.47,0.47,0.47]
[{"$f":"IF((AND(A14<$B$50,A16>$B$50)),$B$50,\"0,00\")","v":"0,00"},{"$f":"B16+((($A15-$A16)/($A14-$A16))*(B14-B16))","v":2.4000000000000012},2.4000000000000012,{"$f":"D16+((($A15-$A16)/($A14-$A16))*(D14-D16))","v":1.9700000000000006},2.4000000000000008,{"$f":"F16+((($A15-$A16)/($A14-$A16))*(F14-F16))","v":1.5400000000000005},1.9600000000000011,{"$f":"H16+((($A15-$A16)/($A14-$A16))*(H14-H16))","v":1.1199999999999999},1.5800000000000003,{"$f":"J16+((($A15-$A16)/($A14-$A16))*(J14-J16))","v":0.88999999999999968},1.1599999999999993,{"$f":"L16+((($A15-$A16)/($A14-$A16))*(L14-L16))","v":0.79999999999999982},1.2199999999999998,{"$f":"N16+((($A15-$A16)/($A14-$A16))*(N14-N16))","v":0.58999999999999986},0.58999999999999986,0.58999999999999986]
[0.5,{"$f":"D16+(((B$5-D$5)/(F$5-D$5))*(F16-D16))","v":1.3499999999999999},1.3499999999999999,1.17,1.3499999999999999,0.99,1.21,0.77,1.03,0.64,0.90999999999999992,0.55000000000000004,0.77000000000000013,0.44,0.44,0.44]
[{"$f":"IF((AND(A16<$B$50,A18>$B$50)),$B$50,\"0,00\")","v":"0,00"},{"$f":"B18+((($A17-$A18)/($A16-$A18))*(B16-B18))","v":2.0999999999999983},2.0999999999999983,{"$f":"D18+((($A17-$A18)/($A16-$A18))*(D16-D18))","v":1.7699999999999996},2.0999999999999992,{"$f":"F18+((($A17-$A18)/($A16-$A18))*(F16-F18))","v":1.44},1.8099999999999996,{"$f":"H18+((($A17-$A18)/($A16-$A18))*(H16-H18))","v":1.0700000000000003},1.4300000000000002,{"$f":"J18+((($A17-$A18)/($A16-$A18))*(J16-J18))","v":0.89000000000000035},1.4600000000000009,{"$f":"L18+((($A17-$A18)/($A16-$A18))*(L16-L18))","v":0.70000000000000018},1.0200000000000002,{"$f":"N18+((($A17-$A18)/($A16-$A18))*(N16-N18))","v":0.54000000000000015},0.54000000000000015,0.54000000000000015]
[0.6,{"$f":"D18+(((B$5-D$5)/(F$5-D$5))*(F18-D18))","v":1.2000000000000002},1.2000000000000002,1.05,1.2000000000000002,0.9,1.0900000000000001,0.71,0.95,0.59,0.79999999999999982,0.52,0.72000000000000008,0.42,0.42,0.42]
[{"$f":"IF((AND(A18<$B$50,A20>$B$50)),$B$50,\"0,00\")","v":"0,00"},{"$f":"B20+((($A19-$A20)/($A18-$A20))*(B18-B20))","v":1.9200000000000008},1.9200000000000008,{"$f":"D20+((($A19-$A20)/($A18-$A20))*(D18-D20))","v":1.6500000000000008},1.920000000000001,{"$f":"F20+((($A19-$A20)/($A18-$A20))*(F18-F20))","v":1.3800000000000006},1.7500000000000016,{"$f":"H20+((($A19-$A20)/($A18-$A20))*(H18-H20))","v":1.0099999999999996},1.4899999999999998,{"$f":"J20+((($A19-$A20)/($A18-$A20))*(J18-J20))","v":0.76999999999999946},0.97999999999999732,{"$f":"L20+((($A19-$A20)/($A18-$A20))*(L18-L20))","v":0.70000000000000018},0.9000000000000008,{"$f":"N20+((($A19-$A20)/($A18-$A20))*(N18-N20))","v":0.59999999999999987},0.59999999999999987,0.59999999999999987]
[0.7,{"$f":"D20+(((B$5-D$5)/(F$5-D$5))*(F20-D20))","v":1.08},1.08,0.95,1.08,0.82,0.97999999999999987,0.66,0.86,0.56000000000000005,0.77000000000000024,0.49,0.69,0.39,0.39,0.39]
[{"$f":"IF((AND(A20<$B$50,A22>$B$50)),$B$50,\"0,00\")","v":"0,00"},{"$f":"B22+((($A21-$A22)/($A20-$A22))*(B20-B22))","v":1.78},1.78,{"$f":"D22+((($A21-$A22)/($A20-$A22))*(D20-D22))","v":1.5099999999999991},1.7799999999999991,{"$f":"F22+((($A21-$A22)/($A20-$A22))*(F20-F22))","v":1.2399999999999991},1.4699999999999982,{"$f":"H22+((($A21-$A22)/($A20-$A22))*(H20-H22))","v":1.01},1.3499999999999999,{"$f":"J22+((($A21-$A22)/($A20-$A22))*(J20-J22))","v":0.84000000000000008},1.2600000000000018,{"$f":"L22+((($A21-$A22)/($A20-$A22))*(L20-L22))","v":0.69999999999999951},1.1799999999999984,{"$f":"N22+((($A21-$A22)/($A20-$A22))*(N20-N22))","v":0.46},0.46,0.46]
[0.8,{"$f":"D22+(((B$5-D$5)/(F$5-D$5))*(F22-D22))","v":0.98},0.98,0.87,0.98,0.76,0.91,0.61,0.78999999999999992,0.52,0.7,0.46,0.62000000000000011,0.38,0.38,0.38]
[{"$f":"IF((AND(A22<$B$50,A24>$B$50)),$B$50,\"0,00\")","v":"0,00"},{"$f":"B24+((($A23-$A24)/($A22-$A24))*(B22-B24))","v":1.6199999999999988},1.6199999999999988,{"$f":"D24+((($A23-$A24)/($A22-$A24))*(D22-D24))","v":1.4299999999999997},1.6199999999999988,{"$f":"F24+((($A23-$A24)/($A22-$A24))*(F22-F24))","v":1.2400000000000007},1.630000000000001,{"$f":"H24+((($A23-$A24)/($A22-$A24))*(H22-H24))","v":0.85000000000000031},1.0300000000000005,{"$f":"J24+((($A23-$A24)/($A22-$A24))*(J22-J24))","v":0.76000000000000023},1.1800000000000002,{"$f":"L24+((($A23-$A24)/($A22-$A24))*(L22-L24))","v":0.62000000000000022},0.78000000000000036,{"$f":"N24+((($A23-$A24)/($A22-$A24))*(N22-N24))","v":0.54000000000000015},0.54000000000000015,0.54000000000000015]
[0.9,{"$f":"D24+(((B$5-D$5)/(F$5-D$5))*(F24-D24))","v":0.90000000000000013},0.90000000000000013,0.8,0.90000000000000013,0.7,0.82,0.57999999999999996,0.7599999999999999,0.49,0.6399999999999999,0.44,0.60000000000000009,0.36,0.36,0.36]
[{"$f":"IF((AND(A24<$B$50,A26>$B$50)),$B$50,\"0,00\")","v":"0,00"},{"$f":"B26+((($A25-$A26)/($A24-$A26))*(B24-B26))","v":6.3900000000000032},6.3900000000000032,{"$f":"D26+((($A25-$A26)/($A24-$A26))*(D24-D26))","v":3.7700000000000014},6.3900000000000032,{"$f":"F26+((($A25-$A26)/($A24-$A26))*(F24-F26))","v":1.1499999999999995},1.3599999999999997,{"$f":"H26+((($A25-$A26)/($A24-$A26))*(H24-H26))","v":0.93999999999999928},1.4799999999999975,{"$f":"J26+((($A25-$A26)/($A24-$A26))*(J24-J26))","v":0.67000000000000015},0.82,{"$f":"L26+((($A25-$A26)/($A24-$A26))*(L24-L26))","v":0.62000000000000022},0.78000000000000125,{"$f":"N26+((($A25-$A26)/($A24-$A26))*(N24-N26))","v":0.5399999999999997},0.5399999999999997,0.5399999999999997]
[1,{"$f":"D26+(((B$5-D$5)/(F$5-D$5))*(F26-D26))","v":0.28999999999999992},0.28999999999999992,0.47,0.28999999999999992,0.65,0.76,0.54,0.68000000000000016,0.47,0.61999999999999988,0.42,0.57999999999999985,0.34,0.34,0.34]
[{"$f":"IF((AND(A26<$B$50,A28>$B$50)),$B$50,\"0,00\")","v":"0,00"},{"$f":"B28+((($A27-$A28)/($A26-$A28))*(B26-B28))","v":-4.5099999999999962},-4.5099999999999962,{"$f":"D28+((($A27-$A28)/($A26-$A28))*(D26-D28))","v":-1.7299999999999978},-4.5099999999999953,{"$f":"F28+((($A27-$A28)/($A26-$A28))*(F26-F28))","v":1.05},1.26,{"$f":"H28+((($A27-$A28)/($A26-$A28))*(H26-H28))","v":0.84000000000000008},1.1800000000000013,{"$f":"J28+((($A27-$A28)/($A26-$A28))*(J26-J28))","v":0.66999999999999948},0.81999999999999962,{"$f":"L28+((($A27-$A28)/($A26-$A28))*(L26-L28))","v":0.61999999999999944},0.97999999999999821,{"$f":"N28+((($A27-$A28)/($A26-$A28))*(N26-N28))","v":0.44000000000000006},0.44000000000000006,0.44000000000000006]
[1.1000000000000001,{"$f":"D28+(((B$5-D$5)/(F$5-D$5))*(F28-D28))","v":0.76999999999999991},0.76999999999999991,0.69,0.76999999999999991,0.61,0.71,0.51,0.63,0.45,0.6,0.4,0.54,0.33,0.33,0.33]
[{"$f":"IF((AND(A28<$B$50,A30>$B$50)),$B$50,\"0,00\")","v":"0,00"},{"$f":"B30+((($A29-$A30)/($A28-$A30))*(B28-B30))","v":1.5399999999999991},1.5399999999999991,{"$f":"D30+((($A29-$A30)/($A28-$A30))*(D28-D30))","v":1.24},1.5399999999999991,{"$f":"F30+((($A29-$A30)/($A28-$A30))*(F28-F30))","v":0.94000000000000083},1.1500000000000012,{"$f":"H30+((($A29-$A30)/($A28-$A30))*(H28-H30))","v":0.73000000000000054},0.63,{"$f":"J30+((($A29-$A30)/($A28-$A30))*(J28-J30))","v":0.7800000000000008},1.2600000000000016,{"$f":"L30+((($A29-$A30)/($A28-$A30))*(L28-L30))","v":0.62000000000000055},0.98000000000000109,{"$f":"N30+((($A29-$A30)/($A28-$A30))*(N28-N30))","v":0.44000000000000028},0.44000000000000028,0.44000000000000028]
[1.2,{"$f":"D30+(((B$5-D$5)/(F$5-D$5))*(F30-D30))","v":0.70000000000000007},0.70000000000000007,0.64,0.70000000000000007,0.57999999999999996,0.66999999999999993,0.49,0.63,0.42,0.53999999999999992,0.38,0.5,0.32,0.32,0.32]
[{"$f":"IF((AND(A30<$B$50,A32>$B$50)),$B$50,\"0,00\")","v":"0,00"},{"$f":"B32+((($A31-$A32)/($A30-$A32))*(B30-B32))","v":1.3000000000000014},1.3000000000000014,{"$f":"D32+((($A31-$A32)/($A30-$A32))*(D30-D32))","v":1.1200000000000001},1.3000000000000016,{"$f":"F32+((($A31-$A32)/($A30-$A32))*(F30-F32))","v":0.93999999999999861},1.029999999999998,{"$f":"H32+((($A31-$A32)/($A30-$A32))*(H30-H32))","v":0.84999999999999931},1.469999999999998,{"$f":"J32+((($A31-$A32)/($A30-$A32))*(J30-J32))","v":0.54},0.30000000000000016,{"$f":"L32+((($A31-$A32)/($A30-$A32))*(L30-L32))","v":0.62},0.73999999999999988,{"$f":"N32+((($A31-$A32)/($A30-$A32))*(N30-N32))","v":0.56000000000000005},0.56000000000000005,0.56000000000000005]
[1.3,{"$f":"D32+(((B$5-D$5)/(F$5-D$5))*(F32-D32))","v":0.64999999999999991},0.64999999999999991,0.6,0.64999999999999991,0.55000000000000004,0.64000000000000012,0.46,0.56000000000000005,0.41,0.55999999999999994,0.36,0.48,0.3,0.3,0.3]
[{"$f":"IF((AND(A32<$B$50,A34>$B$50)),$B$50,\"0,00\")","v":"0,00"},{"$f":"B34+((($A33-$A34)/($A32-$A34))*(B32-B34))","v":1.0400000000000009},1.0400000000000009,{"$f":"D34+((($A33-$A34)/($A32-$A34))*(D32-D34))","v":0.99000000000000088},1.0400000000000009,{"$f":"F34+((($A33-$A34)/($A32-$A34))*(F32-F34))","v":0.94000000000000095},1.1600000000000013,{"$f":"H34+((($A33-$A34)/($A32-$A34))*(H32-H34))","v":0.72000000000000064},0.82000000000000228,{"$f":"J34+((($A33-$A34)/($A32-$A34))*(J32-J34))","v":0.66999999999999982},1.2099999999999986,{"$f":"L34+((($A33-$A34)/($A32-$A34))*(L32-L34))","v":0.49000000000000027},0.61000000000000032,{"$f":"N34+((($A33-$A34)/($A32-$A34))*(N32-N34))","v":0.43000000000000027},0.43000000000000027,0.43000000000000027]
[1.4,{"$f":"D34+(((B$5-D$5)/(F$5-D$5))*(F34-D34))","v":0.61999999999999988},0.61999999999999988,0.56999999999999995,0.61999999999999988,0.52,0.60000000000000009,0.44,0.54,0.39,0.51000000000000012,0.35,0.47,0.28999999999999998,0.28999999999999998,0.28999999999999998]
[{"$f":"IF((AND(A34<$B$50,A36>$B$50)),$B$50,\"0,00\")","v":"0,00"},{"$f":"B36+((($A35-$A36)/($A34-$A36))*(B34-B36))","v":1.0399999999999967},1.0399999999999967,{"$f":"D36+((($A35-$A36)/($A34-$A36))*(D34-D36))","v":0.98999999999999833},1.0399999999999967,{"$f":"F36+((($A35-$A36)/($A34-$A36))*(F34-F36))","v":0.94},1.1599999999999999,{"$f":"H36+((($A35-$A36)/($A34-$A36))*(H34-H36))","v":0.72},0.82000000000000006,{"$f":"J36+((($A35-$A36)/($A34-$A36))*(J34-J36))","v":0.66999999999999993},1.2100000000000022,{"$f":"L36+((($A35-$A36)/($A34-$A36))*(L34-L36))","v":0.48999999999999921},0.60999999999999932,{"$f":"N36+((($A35-$A36)/($A34-$A36))*(N34-N36))","v":0.42999999999999916},0.42999999999999916,0.42999999999999916]
[1.5,{"$f":"D36+(((B$5-D$5)/(F$5-D$5))*(F36-D36))","v":0.59000000000000008},0.59000000000000008,0.54,0.59000000000000008,0.49,0.56000000000000005,0.42,0.52,0.37,0.45999999999999991,0.34,0.46,0.28000000000000003,0.28000000000000003,0.28000000000000003]
[{"$f":"IF((AND(A36<$B$50,A38>$B$50)),$B$50,\"0,00\")","v":"0,00"},{"$f":"B38+((($A37-$A38)/($A36-$A38))*(B36-B38))","v":1.19},1.19,{"$f":"D38+((($A37-$A38)/($A36-$A38))*(D36-D38))","v":0.99},1.19,{"$f":"F38+((($A37-$A38)/($A36-$A38))*(F36-F38))","v":0.79},0.86000000000000099,{"$f":"H38+((($A37-$A38)/($A36-$A38))*(H36-H38))","v":0.71999999999999909},1.1199999999999972,{"$f":"J38+((($A37-$A38)/($A36-$A38))*(J36-J38))","v":0.52},0.16000000000000003,{"$f":"L38+((($A37-$A38)/($A36-$A38))*(L36-L38))","v":0.64},1.3599999999999999,{"$f":"N38+((($A37-$A38)/($A36-$A38))*(N36-N38))","v":0.28000000000000003},0.28000000000000003,0.28000000000000003]
[1.6,{"$f":"D38+(((B$5-D$5)/(F$5-D$5))*(F38-D38))","v":0.55000000000000004},0.55000000000000004,0.51,0.55000000000000004,0.47,0.53999999999999992,0.4,0.48000000000000009,0.36,0.47999999999999993,0.32,0.39999999999999997,0.28000000000000003,0.28000000000000003,0.28000000000000003]
[{"$f":"IF((AND(A38<$B$50,A40>$B$50)),$B$50,\"0,00\")","v":"0,00"},{"$f":"B40+((($A39-$A40)/($A38-$A40))*(B38-B40))","v":0.87000000000000077},0.87000000000000077,{"$f":"D40+((($A39-$A40)/($A38-$A40))*(D38-D40))","v":0.83000000000000074},0.87000000000000166,{"$f":"F40+((($A39-$A40)/($A38-$A40))*(F38-F40))","v":0.78999999999999981},1.0199999999999991,{"$f":"H40+((($A39-$A40)/($A38-$A40))*(H38-H40))","v":0.56000000000000039},0.64000000000000046,{"$f":"J40+((($A39-$A40)/($A38-$A40))*(J38-J40))","v":0.52000000000000035},0.64000000000000035,{"$f":"L40+((($A39-$A40)/($A38-$A40))*(L38-L40))","v":0.48000000000000037},0.56000000000000028,{"$f":"N40+((($A39-$A40)/($A38-$A40))*(N38-N40))","v":0.44000000000000039},0.44000000000000039,0.44000000000000039]
[1.7,{"$f":"D40+(((B$5-D$5)/(F$5-D$5))*(F40-D40))","v":0.53},0.53,0.49,0.53,0.45,0.51,0.39,0.47000000000000008,0.35,0.46999999999999992,0.31,0.38999999999999996,0.27,0.27,0.27]
[{"$f":"IF((AND(A40<$B$50,A42>$B$50)),$B$50,\"0,00\")","v":"0,00"},{"$f":"B42+((($A41-$A42)/($A40-$A42))*(B40-B42))","v":1.2099999999999991},1.2099999999999991,{"$f":"D42+((($A41-$A42)/($A40-$A42))*(D40-D42))","v":0.99999999999999911},1.2099999999999982,{"$f":"F42+((($A41-$A42)/($A40-$A42))*(F40-F42))","v":0.79},0.85000000000000009,{"$f":"H42+((($A41-$A42)/($A40-$A42))*(H40-H42))","v":0.73},0.81000000000000183,{"$f":"J42+((($A41-$A42)/($A40-$A42))*(J40-J42))","v":0.68999999999999906},1.3199999999999963,{"$f":"L42+((($A41-$A42)/($A40-$A42))*(L40-L42))","v":0.48},0.55999999999999983,{"$f":"N42+((($A41-$A42)/($A40-$A42))*(N40-N42))","v":0.44000000000000006},0.44000000000000006,0.44000000000000006]
[1.8,{"$f":"D42+(((B$5-D$5)/(F$5-D$5))*(F42-D42))","v":0.49000000000000005},0.49000000000000005,0.46,0.49000000000000005,0.43,0.49,0.37,0.44999999999999996,0.33,0.4200000000000001,0.3,0.37999999999999995,0.26,0.26,0.26]
[{"$f":"IF((AND(A42<$B$50,A44>$B$50)),$B$50,\"0,00\")","v":"0,00"},{"$f":"B44+((($A43-$A44)/($A42-$A44))*(B42-B44))","v":0.85000000000000087},0.85000000000000087,{"$f":"D44+((($A43-$A44)/($A42-$A44))*(D42-D44))","v":0.82000000000000084},0.85000000000000087,{"$f":"F44+((($A43-$A44)/($A42-$A44))*(F42-F44))","v":0.79000000000000081},1.0300000000000011,{"$f":"H44+((($A43-$A44)/($A42-$A44))*(H42-H44))","v":0.55000000000000038},0.63000000000000023,{"$f":"J44+((($A43-$A44)/($A42-$A44))*(J42-J44))","v":0.51000000000000045},0.60000000000000053,{"$f":"L44+((($A43-$A44)/($A42-$A44))*(L42-L44))","v":0.48000000000000043},0.5600000000000005,{"$f":"N44+((($A43-$A44)/($A42-$A44))*(N42-N44))","v":0.44000000000000039},0.44000000000000039,0.44000000000000039]
[1.9,{"$f":"D44+(((B$5-D$5)/(F$5-D$5))*(F44-D44))","v":0.47000000000000003},0.47000000000000003,0.44,0.47000000000000003,0.41,0.45999999999999996,0.36,0.43999999999999995,0.32,0.41000000000000009,0.28999999999999998,0.36999999999999994,0.25,0.25,0.25]
[{"$f":"IF((AND(A44<$B$50,A46>$B$50)),$B$50,\"0,00\")","v":"0,00"},{"$f":"B46+((($A45-$A46)/($A44-$A46))*(B44-B46))","v":0.85000000000000109},0.85000000000000109,{"$f":"D46+((($A45-$A46)/($A44-$A46))*(D44-D46))","v":0.82000000000000006},0.8500000000000012,{"$f":"F46+((($A45-$A46)/($A44-$A46))*(F44-F46))","v":0.78999999999999893},1.0299999999999978,{"$f":"H46+((($A45-$A46)/($A44-$A46))*(H44-H46))","v":0.55000000000000004},0.63000000000000012,{"$f":"J46+((($A45-$A46)/($A44-$A46))*(J44-J46))","v":0.51},0.6000000000000032,{"$f":"L46+((($A45-$A46)/($A44-$A46))*(L44-L46))","v":0.47999999999999893},0.55999999999999672,{"$f":"N46+((($A45-$A46)/($A44-$A46))*(N44-N46))","v":0.44},0.44,0.44]
[2,{"$f":"D46+(((B$5-D$5)/(F$5-D$5))*(F46-D46))","v":0.44999999999999996},0.44999999999999996,0.42,0.44999999999999996,0.39,0.43000000000000005,0.35,0.42999999999999994,0.31,0.39999999999999991,0.28000000000000003,0.3600000000000001,0.24,0.24,0.24]
[{"$f":"IF((AND(A46<$B$50,A48>$B$50)),$B$50,\"0,00\")","v":"0,00"},{"$f":"B48+((($A47-$A48)/($A46-$A48))*(B46-B48))","v":0.48374999999999996},0.48374999999999996,{"$f":"D48+((($A47-$A48)/($A46-$A48))*(D46-D48))","v":0.45150000000000001},0.48375000000000001,{"$f":"F48+((($A47-$A48)/($A46-$A48))*(F46-F48))","v":0.41925000000000001},0.46225000000000005,{"$f":"H48+((($A47-$A48)/($A46-$A48))*(H46-H48))","v":0.37624999999999997},0.46224999999999994,{"$f":"J48+((($A47-$A48)/($A46-$A48))*(J46-J48))","v":0.33324999999999999},0.42999999999999983,{"$f":"L48+((($A47-$A48)/($A46-$A48))*(L46-L48))","v":0.30100000000000005},0.38700000000000012,{"$f":"N48+((($A47-$A48)/($A46-$A48))*(N46-N48))","v":0.25800000000000001},0.25800000000000001,0.25800000000000001]
[10,{"$f":"D48+(((B$5-D$5)/(F$5-D$5))*(F48-D48))","v":0.315},0.315,{"$f":"D46*(1-$A$4)","v":0.29399999999999998},0.315,{"$f":"F46*(1-$A$4)","v":0.27299999999999996},0.30099999999999993,{"$f":"H46*(1-$A$4)","v":0.24499999999999997},0.30099999999999993,{"$f":"J46*(1-$A$4)","v":0.217},{"$f":"J48+(((K$5-J$5)/(L$5-J$5))*(L48-J48))","v":0.27999999999999997},{"$f":"L46*(1-$A$4)","v":0.19600000000000001},0.25200000000000006,{"$f":"N46*(1-$A$4)","v":0.16799999999999998},{"$f":"N48+(((O$5-N$5)/(P$5-N$5))*(P48-N48))","v":0.16799999999999998},0.16799999999999998]
[]
["Rm",{"$f":"'Recop. Datos'!J18","v":0},null,"z",{"$f":"IF(Cerramiento!G3=\"ESTIMADOS\",Auxiliar!AF34,'Datos necesarios'!$R$35)","v":0},null,"UT",{"$f":"IFERROR((INDEX(B6:P48,MATCH(B50,A6:A48,0),MATCH(E50,B5:P5,0))),0)","v":4.8}]

{"sheet":"Tabla7","index":13,"n_rows":31,"n_cols":7,"rows_kept":31,"cut":false,"hidden":true,"merged":[[27,5,28,6],[29,5,30,6],[0,0,1,6],[2,1,3,2],[2,3,3,4],[2,5,3,6],[25,5,26,6]]}
["Tabla 7. COEFICIENTE DE REDUCCIÓN DE TEMPERATURA b"]
[]
[null,"No aisladonh-e\nAisladoh-nh",null,"No aisladonh-e\nNo aisladoh-nh",null,"Aisladonh-e\nNo aisladoh-nh"]
[]
["Ah-nh/Anh-e","CASO 1","CASO 2","CASO 1","CASO 2","CASO 1","CASO 2"]
[0,0.99,1,0.94,0.97,0.91,0.96]
[{"$f":"IF((AND(A6<$B$26,A8>$B$26)),$B$26,\"0,00\")","v":"0,00"},{"$f":"B6","v":0.99},{"$f":"C6","v":1},0.94,0.97,0.91,0.96]
[0.25,0.97,0.99,0.85,0.92,0.77,0.9]
[{"$f":"IF((AND(A8<$B$26,A10>$B$26)),$B$26,\"0,00\")","v":"0,00"},{"$f":"B8","v":0.97},{"$f":"C8","v":0.99},{"$f":"D8","v":0.85},{"$f":"E8","v":0.92},{"$f":"F8","v":0.77},{"$f":"G8","v":0.9}]
[0.5,0.96,0.98,0.77,0.87,0.67,0.84]
[{"$f":"IF((AND(A10<$B$26,A12>$B$26)),$B$26,\"0,00\")","v":"0,00"},{"$f":"B10","v":0.96},{"$f":"C10","v":0.98},{"$f":"D10","v":0.77},{"$f":"E10","v":0.87},{"$f":"F10","v":0.67},{"$f":"G10","v":0.84}]
[0.75,0.94,0.97,0.7,0.83,0.59,0.79]
[{"$f":"IF((AND(A12<$B$26,A14>$B$26)),$B$26,\"0,00\")","v":"0,00"},{"$f":"B12","v":0.94},{"$f":"C12","v":0.97},{"$f":"D12","v":0.7},{"$f":"E12","v":0.83},{"$f":"F12","v":0.59},{"$f":"G12","v":0.79}]
[1,0.92,0.96,0.65,0.79,0.53,0.74]
[{"$f":"IF((AND(A14<$B$26,A16>$B$26)),$B$26,\"0,00\")","v":"0,00"},{"$f":"B14","v":0.92},{"$f":"C14","v":0.96},{"$f":"D14","v":0.65},{"$f":"E14","v":0.79},{"$f":"F14","v":0.53},{"$f":"G14","v":0.74}]
[1.25,0.89,0.95,0.56000000000000005,0.73,0.44,0.67]
[{"$f":"IF((AND(A16<$B$26,A18>$B$26)),$B$26,\"0,00\")","v":"0,00"},{"$f":"B16","v":0.89},{"$f":"C16","v":0.95},{"$f":"D16","v":0.56000000000000005},{"$f":"E16","v":0.73},{"$f":"F16","v":0.44},{"$f":"G16","v":0.67}]
[2,0.86,0.93,0.48,0.66,0.36,0.59]
[{"$f":"IF((AND(A18<$B$26,A20>$B$26)),$B$26,\"0,00\")","v":"0,00"},{"$f":"B18","v":0.86},{"$f":"C18","v":0.93},{"$f":"D18","v":0.48},{"$f":"E18","v":0.66},{"$f":"F18","v":0.36},{"$f":"G18","v":0.59}]
[2.5,0.83,0.91,0.43,0.61,0.32,0.54]
[{"$f":"IF((AND(A20<$B$26,A22>$B$26)),$B$26,\"0,00\")","v":"0,00"},{"$f":"B20","v":0.83},{"$f":"C20","v":0.91},{"$f":"D20","v":0.43},{"$f":"E20","v":0.61},{"$f":"F20","v":0.32},{"$f":"G20","v":0.54}]
[3,0.81,0.9,0.39,0.56999999999999995,0.28000000000000003,0.5]
[{"$f":"IF((AND(A22<$B$26,A24>$B$26)),$B$26,\"0,00\")","v":"0,00"},{"$f":"B22","v":0.81},{"$f":"C22","v":0.9},{"$f":"D22","v":0.39},{"$f":"E22","v":0.56999999999999995},{"$f":"F22","v":0.28000000000000003},{"$f":"G22","v":0.5}]
[10000,{"$f":"B22","v":0.81},{"$f":"C22","v":0.9},0.39,0.56999999999999995,0.28000000000000003,0.5]
[]
["Ah-nh/Anh-e",{"$f":"IFERROR(('Datos necesarios'!H7/'Datos necesarios'!H9),0)","v":0},{"$f":"CONCATENATE(1,1)","v":"11"},"b (CASO 1)",{"$f":"IFERROR((INDEX(B6:B24,MATCH(B26,A6:A24,0))),0)","v":0.99},"No aisladonh-e\nAisladoh-nh"]
[null,null,{"$f":"CONCATENATE(2,1)","v":"21"},"b (CASO 2)",{"$f":"IFERROR((INDEX(C6:C24,MATCH(B26,A6:A24,0))),0)","v":1}]
[null,null,{"$f":"CONCATENATE(1,2)","v":"12"},"b (CASO 1)",{"$f":"IFERROR((INDEX(D6:D24,MATCH(B26,A6:A24,0))),0)","v":0.94},"No aisladonh-e\nNo aisladoh-nh"]
[null,null,{"$f":"CONCATENATE(2,2)","v":"22"},"b (CASO 2)",{"$f":"IFERROR((INDEX(E6:E24,MATCH(B26,A6:A24,0))),0)","v":0.97}]
[null,null,{"$f":"CONCATENATE(1,3)","v":"13"},"b (CASO 1)",{"$f":"IFERROR((INDEX(F6:F24,MATCH(B26,A6:A24,0))),0)","v":0.91},"Aisladonh-e\nNo aisladoh-nh"]
[null,null,{"$f":"CONCATENATE(2,3)","v":"23"},"b (CASO 2)",{"$f":"IFERROR((INDEX(G6:G24,MATCH(B26,A6:A24,0))),0)","v":0.96}]

{"sheet":"Tabla7V","index":14,"n_rows":31,"n_cols":7,"rows_kept":31,"cut":false,"hidden":true,"merged":[[29,5,30,6],[0,0,1,6],[2,1,3,2],[2,3,3,4],[2,5,3,6],[25,5,26,6],[27,5,28,6]]}
["Tabla 7. COEFICIENTE DE REDUCCIÓN DE TEMPERATURA b"]
[]
[null,"No aisladonh-e\nAisladoh-nh",null,"No aisladonh-e\nNo aisladoh-nh",null,"Aisladonh-e\nNo aisladoh-nh"]
[]
["Ah-nh/Anh-e","CASO 1","CASO 2","CASO 1","CASO 2","CASO 1","CASO 2"]
[0,0.99,1,0.94,0.97,0.91,0.96]
[{"$f":"IF((AND(A6<$B$26,A8>$B$26)),$B$26,\"0,00\")","v":"0,00"},{"$f":"B6","v":0.99},{"$f":"C6","v":1},0.94,0.97,0.91,0.96]
[0.25,0.97,0.99,0.85,0.92,0.77,0.9]
[{"$f":"IF((AND(A8<$B$26,A10>$B$26)),$B$26,\"0,00\")","v":"0,00"},{"$f":"B8","v":0.97},{"$f":"C8","v":0.99},0.85,0.92,0.77,0.9]
[0.5,0.96,0.98,0.77,0.87,0.67,0.84]
[{"$f":"IF((AND(A10<$B$26,A12>$B$26)),$B$26,\"0,00\")","v":"0,00"},{"$f":"B10","v":0.96},{"$f":"C10","v":0.98},0.77,0.87,0.67,0.84]
[0.75,0.94,0.97,0.7,0.83,0.59,0.79]
[{"$f":"IF((AND(A12<$B$26,A14>$B$26)),$B$26,\"0,00\")","v":"0,00"},{"$f":"B12","v":0.94},{"$f":"C12","v":0.97},0.7,0.83,0.59,0.79]
[1,0.92,0.96,0.65,0.79,0.53,0.74]
[{"$f":"IF((AND(A14<$B$26,A16>$B$26)),$B$26,\"0,00\")","v":"0,00"},{"$f":"B14","v":0.92},{"$f":"C14","v":0.96},0.65,0.79,0.53,0.74]
[1.25,0.89,0.95,0.56000000000000005,0.73,0.44,0.67]
[{"$f":"IF((AND(A16<$B$26,A18>$B$26)),$B$26,\"0,00\")","v":"0,00"},{"$f":"B16","v":0.89},{"$f":"C16","v":0.95},0.56000000000000005,0.73,0.44,0.67]
[2,0.86,0.93,0.48,0.66,0.36,0.59]
[{"$f":"IF((AND(A18<$B$26,A20>$B$26)),$B$26,\"0,00\")","v":"0,00"},{"$f":"B18","v":0.86},{"$f":"C18","v":0.93},0.48,0.66,0.36,0.59]
[2.5,0.83,0.91,0.43,0.61,0.32,0.54]
[{"$f":"IF((AND(A20<$B$26,A22>$B$26)),$B$26,\"0,00\")","v":"0,00"},{"$f":"B20","v":0.83},{"$f":"C20","v":0.91},0.43,0.61,0.32,0.54]
[3,0.81,0.9,0.39,0.56999999999999995,0.28000000000000003,0.5]
[{"$f":"IF((AND(A22<$B$26,A24>$B$26)),$B$26,\"0,00\")","v":"0,00"},{"$f":"B22","v":0.81},{"$f":"C22","v":0.9},0.39,0.56999999999999995,0.28000000000000003,0.5]
[10000,{"$f":"B22","v":0.81},{"$f":"C22","v":0.9},0.39,0.56999999999999995,0.28000000000000003,0.5]
[]
["Ah-nh/Anh-e",{"$f":"IFERROR(('Datos necesarios'!H7/'Datos necesarios'!H9),0)","v":0},{"$f":"CONCATENATE(1,1)","v":"11"},"b (CASO 1)",{"$f":"IFERROR((INDEX(B6:B24,MATCH(B26,A6:A24,0))),0)","v":0.99},"No aisladonh-e\nAisladoh-nh"]
[null,null,{"$f":"CONCATENATE(2,1)","v":"21"},"b (CASO 2)",{"$f":"IFERROR((INDEX(C6:C24,MATCH(B26,A6:A24,0))),0)","v":1}]
[null,null,{"$f":"CONCATENATE(1,2)","v":"12"},"b (CASO 1)",{"$f":"IFERROR((INDEX(D6:D24,MATCH(B26,A6:A24,0))),0)","v":0.94},"No aisladonh-e\nNo aisladoh-nh"]
[null,null,{"$f":"CONCATENATE(2,2)","v":"22"},"b (CASO 2)",{"$f":"IFERROR((INDEX(E6:E24,MATCH(B26,A6:A24,0))),0)","v":0.97}]
[null,null,{"$f":"CONCATENATE(1,3)","v":"13"},"b (CASO 1)",{"$f":"IFERROR((INDEX(F6:F24,MATCH(B26,A6:A24,0))),0)","v":0.91},"Aisladonh-e\nNo aisladoh-nh"]
[null,null,{"$f":"CONCATENATE(2,3)","v":"23"},"b (CASO 2)",{"$f":"IFERROR((INDEX(G6:G24,MATCH(B26,A6:A24,0))),0)","v":0.96}]

{"sheet":"Tabla9","index":15,"n_rows":56,"n_cols":16,"rows_kept":56,"cut":false,"hidden":true,"merged":[[2,5,3,9],[0,0,1,15]]}
["Tabla 9. TRANSMITANCIA TÉRMICA Us [W/m²K]"]
[]
[null,null,null,null,null,"Rf [m²\u0097K/ W]"]
[]
["B'",0,{"$f":"IF((AND(B5<$E$56,D5>$E$56)),$E$56,\"0,00\")","v":"0,00"},0.5,{"$f":"IF((AND(D5<$E$56,F5>$E$56)),$E$56,\"0,00\")","v":"0,00"},1,{"$f":"IF((AND(F5<$E$56,H5>$E$56)),$E$56,\"0,00\")","v":"0,00"},1.5,{"$f":"IF((AND(H5<$E$56,J5>$E$56)),$E$56,\"0,00\")","v":"0,00"},2,{"$f":"IF((AND(J5<$E$56,L5>$E$56)),$E$56,\"0,00\")","v":"0,00"},2.5,{"$f":"IF((AND(L5<$E$56,N5>$E$56)),$E$56,\"0,00\")","v":"0,00"},3,{"$f":"IF((AND(N5<$E$56,P5>$E$56)),$E$56,\"0,00\")","v":"0,00"},10]
[0,{"$f":"B10+((($A$6-$A$10)/($A$8-$A$10))*(B8-B10))","v":13.410000000000002},{"$f":"B6+(((C$5-B$5)/(D$5-B$5))*(D6-B6))","v":13.410000000000002},{"$f":"D10+((($A$6-$A$10)/($A$8-$A$10))*(D8-D10))","v":1.8399999999999999},{"$f":"D6+(((E$5-D$5)/(F$5-D$5))*(F6-D6))","v":2.7199999999999998},{"$f":"F10+((($A$6-$A$10)/($A$8-$A$10))*(F8-F10))","v":0.96000000000000008},{"$f":"F6+(((G$5-F$5)/(H$5-F$5))*(H6-F6))","v":1.58},{"$f":"H10+((($A$6-$A$10)/($A$8-$A$10))*(H8-H10))","v":0.65},{"$f":"H6+(((I$5-H$5)/(J$5-H$5))*(J6-H6))","v":1.1600000000000001},{"$f":"J10+((($A$6-$A$10)/($A$8-$A$10))*(J8-J10))","v":0.47999999999999993},{"$f":"J6+(((K$5-J$5)/(L$5-J$5))*(L6-J6))","v":0.83999999999999964},{"$f":"L10+((($A$6-$A$10)/($A$8-$A$10))*(L8-L10))","v":0.39},0.84000000000000041,{"$f":"N10+((($A$6-$A$10)/($A$8-$A$10))*(N8-N10))","v":0.29999999999999993},0.42857142857142849,{"$f":"P10+((($A$6-$A$10)/($A$8-$A$10))*(P8-P10))","v":0}]
[{"$f":"IF((AND(A6<$B$56,A8>$B$56)),$B$56,\"0,0\")","v":"0,0"},{"$f":"B8+((($A7-$A8)/($A6-$A8))*(B6-B8))","v":13.410000000000002},13.410000000000002,{"$f":"D8+((($A7-$A8)/($A6-$A8))*(D6-D8))","v":1.8399999999999999},2.7199999999999998,{"$f":"F8+((($A7-$A8)/($A6-$A8))*(F6-F8))","v":0.96000000000000008},1.58,{"$f":"H8+((($A7-$A8)/($A6-$A8))*(H6-H8))","v":0.65},1.1600000000000001,{"$f":"J8+((($A7-$A8)/($A6-$A8))*(J6-J8))","v":0.47999999999999993},0.83999999999999964,{"$f":"L8+((($A7-$A8)/($A6-$A8))*(L6-L8))","v":0.39},0.84000000000000041,{"$f":"N8+((($A7-$A8)/($A6-$A8))*(N6-N8))","v":0.29999999999999993},0.42857142857142849,{"$f":"P8+((($A7-$A8)/($A6-$A8))*(P6-P8))","v":0}]
[1,9.3800000000000008,9.3800000000000008,1.65,2.4,0.9,1.46,0.62,1.07,0.47,0.82999999999999985,0.38,0.83000000000000007,0.28999999999999998,0.41428571428571426,0]
[{"$f":"IF((AND(A8<$B$56,A10>$B$56)),$B$56,\"0,0\")","v":"0,0"},{"$f":"B10+((($A9-$A10)/($A8-$A10))*(B8-B10))","v":13.410000000000002},13.410000000000002,{"$f":"D10+((($A9-$A10)/($A8-$A10))*(D8-D10))","v":1.8399999999999999},2.7199999999999998,{"$f":"F10+((($A9-$A10)/($A8-$A10))*(F8-F10))","v":0.96000000000000008},1.58,{"$f":"H10+((($A9-$A10)/($A8-$A10))*(H8-H10))","v":0.65},1.1600000000000001,{"$f":"J10+((($A9-$A10)/($A8-$A10))*(J8-J10))","v":0.47999999999999993},0.83999999999999964,{"$f":"L10+((($A9-$A10)/($A8-$A10))*(L8-L10))","v":0.39},0.84000000000000041,{"$f":"N10+((($A9-$A10)/($A8-$A10))*(N8-N10))","v":0.29999999999999993},0.42857142857142849,{"$f":"P10+((($A9-$A10)/($A8-$A10))*(P8-P10))","v":0}]
[2,5.35,5.35,1.46,2.08,0.84,1.3399999999999999,0.59,0.97999999999999976,0.46,0.82000000000000006,0.37,0.81999999999999984,0.28000000000000003,0.4,0]
[{"$f":"IF((AND(A10<$B$56,A12>$B$56)),$B$56,\"0,0\")","v":"0,0"},{"$f":"B12+((($A11-$A12)/($A10-$A12))*(B10-B12))","v":8.2899999999999991},8.2899999999999991,{"$f":"D12+((($A11-$A12)/($A10-$A12))*(D10-D12))","v":1.7399999999999998},2.5599999999999996,{"$f":"F12+((($A11-$A12)/($A10-$A12))*(F10-F12))","v":0.91999999999999982},1.4999999999999996,{"$f":"H12+((($A11-$A12)/($A10-$A12))*(H10-H12))","v":0.63},1.02,{"$f":"J12+((($A11-$A12)/($A10-$A12))*(J10-J12))","v":0.5},0.94,{"$f":"L12+((($A11-$A12)/($A10-$A12))*(L10-L12))","v":0.39},0.94,0.28000000000000003,0.4,{"$f":"P12+((($A11-$A12)/($A10-$A12))*(P10-P12))","v":0}]
[3,3.88,3.88,1.32,1.84,0.8,1.2600000000000002,0.56999999999999995,0.95999999999999974,0.44,0.76,0.36,0.75999999999999979,0.28000000000000003,0.4,0]
[{"$f":"IF((AND(A12<$B$56,A14>$B$56)),$B$56,\"0,0\")","v":"0,0"},{"$f":"B14+((($A13-$A14)/($A12-$A14))*(B12-B14))","v":6.1899999999999995},6.1899999999999995,{"$f":"D14+((($A13-$A14)/($A12-$A14))*(D12-D14))","v":1.6800000000000004},2.4400000000000004,{"$f":"F14+((($A13-$A14)/($A12-$A14))*(F12-F14))","v":0.92000000000000015},1.5000000000000011,{"$f":"H14+((($A13-$A14)/($A12-$A14))*(H12-H14))","v":0.62999999999999967},1.1099999999999985,{"$f":"J14+((($A13-$A14)/($A12-$A14))*(J12-J14))","v":0.47000000000000003},0.79,{"$f":"L14+((($A13-$A14)/($A12-$A14))*(L12-L14))","v":0.39},0.78999999999999981,0.31000000000000005,0.44285714285714295,{"$f":"P14+((($A13-$A14)/($A12-$A14))*(P12-P14))","v":0}]
[4,3.11,3.11,1.2,1.64,0.76,1.18,0.55000000000000004,0.91000000000000014,0.43,0.75,0.35,0.74999999999999978,0.27,0.38571428571428573,0]
[{"$f":"IF((AND(A14<$B$56,A16>$B$56)),$B$56,\"0,0\")","v":"0,0"},{"$f":"B16+((($A15-$A16)/($A14-$A16))*(B14-B16))","v":5.0299999999999994},5.0299999999999994,{"$f":"D16+((($A15-$A16)/($A14-$A16))*(D14-D16))","v":1.4400000000000002},1.9600000000000002,{"$f":"F16+((($A15-$A16)/($A14-$A16))*(F14-F16))","v":0.92000000000000015},1.5000000000000002,{"$f":"H16+((($A15-$A16)/($A14-$A16))*(H14-H16))","v":0.63000000000000012},1.1100000000000003,{"$f":"J16+((($A15-$A16)/($A14-$A16))*(J14-J16))","v":0.47000000000000003},0.95000000000000018,{"$f":"L16+((($A15-$A16)/($A14-$A16))*(L14-L16))","v":0.35},0.74999999999999978,0.27,0.38571428571428573,{"$f":"P16+((($A15-$A16)/($A14-$A16))*(P14-P16))","v":0}]
[5,2.63,2.63,1.1399999999999999,1.5599999999999998,0.72,1.0999999999999999,0.53,0.8600000000000001,0.42,0.7,0.35,0.74999999999999978,0.27,0.38571428571428573,0]
[{"$f":"IF((AND(A16<$B$56,A18>$B$56)),$B$56,\"0,0\")","v":"0,0"},{"$f":"B18+((($A17-$A18)/($A16-$A18))*(B16-B18))","v":4.28},4.28,{"$f":"D18+((($A17-$A18)/($A16-$A18))*(D16-D18))","v":1.4899999999999991},2.1599999999999984,{"$f":"F18+((($A17-$A18)/($A16-$A18))*(F16-F18))","v":0.82000000000000006},1.3,{"$f":"H18+((($A17-$A18)/($A16-$A18))*(H16-H18))","v":0.58000000000000007},0.91000000000000014,{"$f":"J18+((($A17-$A18)/($A16-$A18))*(J16-J18))","v":0.47000000000000003},0.75000000000000111,{"$f":"L18+((($A17-$A18)/($A16-$A18))*(L16-L18))","v":0.39999999999999974},1.0499999999999983,0.27,0.38571428571428573,{"$f":"P18+((($A17-$A18)/($A16-$A18))*(P16-P18))","v":0}]
[6,2.2999999999999998,2.2999999999999998,1.07,1.4400000000000002,0.7,1.0599999999999998,0.52,0.85000000000000009,0.41,0.68999999999999972,0.34,0.69000000000000006,0.27,0.38571428571428573,0]
[{"$f":"IF((AND(A18<$B$56,A20>$B$56)),$B$56,\"0,0\")","v":"0,0"},{"$f":"B20+((($A19-$A20)/($A18-$A20))*(B18-B20))","v":3.7399999999999984},3.7399999999999984,{"$f":"D20+((($A19-$A20)/($A18-$A20))*(D18-D20))","v":1.4300000000000004},1.9800000000000013,{"$f":"F20+((($A19-$A20)/($A18-$A20))*(F18-F20))","v":0.87999999999999945},1.3599999999999981,{"$f":"H20+((($A19-$A20)/($A18-$A20))*(H18-H20))","v":0.64000000000000012},1.1500000000000015,{"$f":"J20+((($A19-$A20)/($A18-$A20))*(J18-J20))","v":0.4699999999999997},0.74999999999999822,{"$f":"L20+((($A19-$A20)/($A18-$A20))*(L18-L20))","v":0.40000000000000008},0.75000000000000011,0.33000000000000007,0.47142857142857153,{"$f":"P20+((($A19-$A20)/($A18-$A20))*(P18-P20))","v":0}]
[7,2.06,2.06,1.01,1.35,0.67,1.0100000000000002,0.5,0.79999999999999993,0.4,0.68,0.33,0.68,0.26,0.37142857142857144,0]
[{"$f":"IF((AND(A20<$B$56,A22>$B$56)),$B$56,\"0,0\")","v":"0,0"},{"$f":"B22+((($A21-$A22)/($A20-$A22))*(B20-B22))","v":3.3899999999999997},3.3899999999999997,{"$f":"D22+((($A21-$A22)/($A20-$A22))*(D20-D22))","v":1.2900000000000003},1.7700000000000005,{"$f":"F22+((($A21-$A22)/($A20-$A22))*(F20-F22))","v":0.81000000000000016},1.2900000000000005,{"$f":"H22+((($A21-$A22)/($A20-$A22))*(H20-H22))","v":0.57000000000000006},0.87,{"$f":"J22+((($A21-$A22)/($A20-$A22))*(J20-J22))","v":0.47000000000000008},1.0300000000000002,{"$f":"L22+((($A21-$A22)/($A20-$A22))*(L20-L22))","v":0.33},0.68,0.26,0.37142857142857144,{"$f":"P22+((($A21-$A22)/($A20-$A22))*(P20-P22))","v":0}]
[8,1.87,1.87,0.97,1.29,0.65,0.97000000000000008,0.49,0.78999999999999992,0.39,0.63,0.33,0.68,0.26,0.37142857142857144,0]
[{"$f":"IF((AND(A22<$B$56,A24>$B$56)),$B$56,\"0,0\")","v":"0,0"},{"$f":"B24+((($A23-$A24)/($A22-$A24))*(B22-B24))","v":2.9900000000000011},2.9900000000000011,{"$f":"D24+((($A23-$A24)/($A22-$A24))*(D22-D24))","v":1.2899999999999994},1.7699999999999987,{"$f":"F24+((($A23-$A24)/($A22-$A24))*(F22-F24))","v":0.81000000000000016},1.2900000000000005,{"$f":"H24+((($A23-$A24)/($A22-$A24))*(H22-H24))","v":0.57000000000000006},1.1100000000000003,{"$f":"J24+((($A23-$A24)/($A22-$A24))*(J22-J24))","v":0.39},0.30999999999999972,{"$f":"L24+((($A23-$A24)/($A22-$A24))*(L22-L24))","v":0.41000000000000009},1.1600000000000006,0.26,0.37142857142857144,{"$f":"P24+((($A23-$A24)/($A22-$A24))*(P22-P24))","v":0}]
[9,1.73,1.73,0.93,1.23,0.63,0.93,0.48,0.74999999999999989,0.39,0.67,0.32,0.62,0.26,0.37142857142857144,0]
[{"$f":"IF((AND(A24<$B$56,A26>$B$56)),$B$56,\"0,0\")","v":"0,0"},{"$f":"B26+((($A25-$A26)/($A24-$A26))*(B24-B26))","v":2.8099999999999987},2.8099999999999987,{"$f":"D26+((($A25-$A26)/($A24-$A26))*(D24-D26))","v":1.2900000000000005},1.8600000000000008,{"$f":"F26+((($A25-$A26)/($A24-$A26))*(F24-F26))","v":0.72000000000000008},1.02,{"$f":"H26+((($A25-$A26)/($A24-$A26))*(H24-H26))","v":0.57000000000000006},0.84,{"$f":"J26+((($A25-$A26)/($A24-$A26))*(J24-J26))","v":0.48000000000000009},1.1200000000000006,{"$f":"L26+((($A25-$A26)/($A24-$A26))*(L24-L26))","v":0.32},0.62,0.26,0.37142857142857144,{"$f":"P26+((($A25-$A26)/($A24-$A26))*(P24-P26))","v":0}]
[10,1.61,1.61,0.89,1.1600000000000001,0.62,0.92,0.47,0.73999999999999988,0.38,0.62,0.32,0.62,0.26,0.37142857142857144,0]
[{"$f":"IF((AND(A26<$B$56,A28>$B$56)),$B$56,\"0,0\")","v":"0,0"},{"$f":"B28+((($A27-$A28)/($A26-$A28))*(B26-B28))","v":2.5100000000000007},2.5100000000000007,{"$f":"D28+((($A27-$A28)/($A26-$A28))*(D26-D28))","v":1.1900000000000004},1.6100000000000008,{"$f":"F28+((($A27-$A28)/($A26-$A28))*(F26-F28))","v":0.77000000000000013},1.1700000000000008,{"$f":"H28+((($A27-$A28)/($A26-$A28))*(H26-H28))","v":0.56999999999999984},0.98999999999999921,{"$f":"J28+((($A27-$A28)/($A26-$A28))*(J26-J28))","v":0.43000000000000005},0.67,{"$f":"L28+((($A27-$A28)/($A26-$A28))*(L26-L28))","v":0.37000000000000005},0.67,0.31000000000000005,0.44285714285714295,{"$f":"P28+((($A27-$A28)/($A26-$A28))*(P26-P28))","v":0}]
[12,1.43,1.43,0.83,1.0699999999999998,0.59,0.86999999999999988,0.45,0.69000000000000006,0.37,0.61,0.31,0.61,0.25,0.35714285714285715,0]
[{"$f":"IF((AND(A28<$B$56,A30>$B$56)),$B$56,\"0,0\")","v":"0,0"},{"$f":"B30+((($A29-$A30)/($A28-$A30))*(B28-B30))","v":2.2099999999999991},2.2099999999999991,{"$f":"D30+((($A29-$A30)/($A28-$A30))*(D28-D30))","v":1.0699999999999994},1.4299999999999988,{"$f":"F30+((($A29-$A30)/($A28-$A30))*(F28-F30))","v":0.71000000000000008},1.1100000000000003,{"$f":"H30+((($A29-$A30)/($A28-$A30))*(H28-H30))","v":0.51},0.74999999999999989,{"$f":"J30+((($A29-$A30)/($A28-$A30))*(J28-J30))","v":0.43000000000000005},0.91000000000000025,{"$f":"L30+((($A29-$A30)/($A28-$A30))*(L28-L30))","v":0.31},0.61,0.25,0.35714285714285715,{"$f":"P30+((($A29-$A30)/($A28-$A30))*(P28-P30))","v":0}]
[14,1.3,1.3,0.79,1.0100000000000002,0.56999999999999995,0.82999999999999985,0.44,0.68,0.36,0.55999999999999994,0.31,0.61,0.25,0.35714285714285715,0]
[{"$f":"IF((AND(A30<$B$56,A32>$B$56)),$B$56,\"0,0\")","v":"0,0"},{"$f":"B32+((($A31-$A32)/($A30-$A32))*(B30-B32))","v":2.0000000000000009},2.0000000000000009,{"$f":"D32+((($A31-$A32)/($A30-$A32))*(D30-D32))","v":1.0700000000000003},1.4300000000000013,{"$f":"F32+((($A31-$A32)/($A30-$A32))*(F30-F32))","v":0.7099999999999993},1.1099999999999979,{"$f":"H32+((($A31-$A32)/($A30-$A32))*(H30-H32))","v":0.51},0.74999999999999989,{"$f":"J32+((($A31-$A32)/($A30-$A32))*(J30-J32))","v":0.43000000000000005},0.63,{"$f":"L32+((($A31-$A32)/($A30-$A32))*(L30-L32))","v":0.38000000000000006},1.0300000000000005,0.25,0.35714285714285715,{"$f":"P32+((($A31-$A32)/($A30-$A32))*(P30-P32))","v":0}]
[16,1.2,1.2,0.75,0.95,0.55000000000000004,0.79000000000000015,0.43,0.67,0.35,0.54999999999999993,0.3,0.54999999999999993,0.25,0.35714285714285715,0]
[{"$f":"IF((AND(A32<$B$56,A34>$B$56)),$B$56,\"0,0\")","v":"0,0"},{"$f":"B34+((($A33-$A34)/($A32-$A34))*(B32-B34))","v":1.8399999999999987},1.8399999999999987,{"$f":"D34+((($A33-$A34)/($A32-$A34))*(D32-D34))","v":0.99000000000000021},1.2700000000000002,{"$f":"F34+((($A33-$A34)/($A32-$A34))*(F32-F34))","v":0.71000000000000019},1.1100000000000005,{"$f":"H34+((($A33-$A34)/($A32-$A34))*(H32-H34))","v":0.51},0.9900000000000001,{"$f":"J34+((($A33-$A34)/($A32-$A34))*(J32-J34))","v":0.35},0.22999999999999965,{"$f":"L34+((($A33-$A34)/($A32-$A34))*(L32-L34))","v":0.38000000000000006},1.0300000000000005,0.25,0.35714285714285715,{"$f":"P34+((($A33-$A34)/($A32-$A34))*(P32-P34))","v":0}]
[18,1.1200000000000001,1.1200000000000001,0.72,0.90999999999999992,0.53,0.75000000000000011,0.42,0.63,0.35,0.59,0.28999999999999998,0.48999999999999988,0.25,0.35714285714285715,0]
[{"$f":"IF((AND(A34<$B$56,A36>$B$56)),$B$56,\"0,0\")","v":"0,0"},{"$f":"B36+((($A35-$A36)/($A34-$A36))*(B34-B36))","v":1.6600000000000006},1.6600000000000006,{"$f":"D36+((($A35-$A36)/($A34-$A36))*(D34-D36))","v":0.99000000000000021},1.2700000000000002,{"$f":"F36+((($A35-$A36)/($A34-$A36))*(F34-F36))","v":0.71000000000000019},1.1100000000000005,{"$f":"H36+((($A35-$A36)/($A34-$A36))*(H34-H36))","v":0.51},0.72000000000000131,{"$f":"J36+((($A35-$A36)/($A34-$A36))*(J34-J36))","v":0.43999999999999956},1.0399999999999978,{"$f":"L36+((($A35-$A36)/($A34-$A36))*(L34-L36))","v":0.28999999999999998},0.48999999999999988,0.25,0.35714285714285715,{"$f":"P36+((($A35-$A36)/($A34-$A36))*(P34-P36))","v":0}]
[20,1.06,1.06,0.69,0.86999999999999988,0.51,0.71000000000000008,0.41,0.61999999999999988,0.34,0.54000000000000026,0.28999999999999998,0.48999999999999988,0.25,0.35714285714285715,0]
[{"$f":"IF((AND(A36<$B$56,A38>$B$56)),$B$56,\"0,0\")","v":"0,0"},{"$f":"B38+((($A37-$A38)/($A36-$A38))*(B36-B38))","v":1.6600000000000006},1.6600000000000006,{"$f":"D38+((($A37-$A38)/($A36-$A38))*(D36-D38))","v":0.88999999999999901},1.1699999999999979,{"$f":"F38+((($A37-$A38)/($A36-$A38))*(F36-F38))","v":0.6100000000000001},0.81000000000000116,{"$f":"H38+((($A37-$A38)/($A36-$A38))*(H36-H38))","v":0.50999999999999956},0.71999999999999797,{"$f":"J38+((($A37-$A38)/($A36-$A38))*(J36-J38))","v":0.44000000000000011},1.0400000000000007,{"$f":"L38+((($A37-$A38)/($A36-$A38))*(L36-L38))","v":0.28999999999999998},0.48999999999999988,0.25,0.35714285714285715,{"$f":"P38+((($A37-$A38)/($A36-$A38))*(P36-P38))","v":0}]
[22,1,1,0.67,0.84000000000000008,0.5,0.7,0.4,0.6100000000000001,0.33,0.49000000000000016,0.28999999999999998,0.48999999999999988,0.25,0.35714285714285715,0]
[{"$f":"IF((AND(A38<$B$56,A40>$B$56)),$B$56,\"0,0\")","v":"0,0"},1.4400000000000004,1.4400000000000004,0.89000000000000024,1.1700000000000004,0.6100000000000001,0.81,0.51000000000000012,1.0500000000000003,0.33,5.0000000000002209E-2,0.39999999999999947,0.59999999999999631,0.3600000000000001,0.51428571428571446,0]
[24,0.96,0.96,0.65,0.81,0.49,0.69,0.39,0.57000000000000006,0.33,0.53,0.28000000000000003,0.4800000000000002,0.24,0.34285714285714286,0]
[{"$f":"IF((AND(A40<$B$56,A42>$B$56)),$B$56,\"0,0\")","v":"0,0"},1.4399999999999991,1.4399999999999991,0.89000000000000024,1.1700000000000004,0.6100000000000001,1.0500000000000003,0.39,0.20999999999999969,0.45000000000000012,1.1300000000000006,0.28000000000000003,0.4800000000000002,0.24,0.34285714285714286,0]
[26,0.92,0.92,0.63,0.78,0.48,0.65999999999999992,0.39,0.60000000000000009,0.32,0.47999999999999993,0.28000000000000003,0.4800000000000002,0.24,0.34285714285714286,0]
[{"$f":"IF((AND(A42<$B$56,A44>$B$56)),$B$56,\"0,0\")","v":"0,0"},1.3100000000000005,1.3100000000000005,0.89000000000000024,1.1700000000000004,0.6100000000000001,0.79,0.52000000000000013,1.1200000000000006,0.32,0.47999999999999993,0.28000000000000003,0.4800000000000002,0.24,0.34285714285714286,0]
[28,0.89,0.89,0.61,0.75,0.47,0.64999999999999991,0.38,0.56000000000000005,0.32,0.47999999999999993,0.28000000000000003,0.4800000000000002,0.24,0.34285714285714286,0]
[{"$f":"IF((AND(A44<$B$56,A46>$B$56)),$B$56,\"0,0\")","v":"0,0"},1.3100000000000005,1.3100000000000005,0.75000000000000011,0.8900000000000009,0.60999999999999932,1.0699999999999981,0.38,0.56000000000000005,0.32,-8.0000000000000571E-2,0.42000000000000015,1.320000000000001,0.24,0.34285714285714286,0]
[30,0.86,0.86,0.6,0.74,0.46,0.62000000000000011,0.38,0.56000000000000005,0.32,0.52,0.27,0.42000000000000015,0.24,0.34285714285714286,0]
[{"$f":"IF((AND(A46<$B$56,A48>$B$56)),$B$56,\"0,0\")","v":"0,0"},1.3100000000000005,1.3100000000000005,0.75000000000000011,0.89000000000000012,0.6100000000000001,0.77,0.53000000000000014,0.71000000000000019,0.47000000000000014,1.2700000000000007,0.27,-0.32999999999999829,0.38999999999999968,0.55714285714285672,0]
[32,0.83,{"$f":"B48+(((C$5-B$5)/(D$5-B$5))*(D48-B48))","v":0.83},0.59,{"$f":"D48+(((E$5-D$5)/(F$5-D$5))*(F48-D48))","v":0.73},0.45,{"$f":"F48+(((G$5-F$5)/(H$5-F$5))*(H48-F48))","v":0.6100000000000001},0.37,{"$f":"H48+(((I$5-H$5)/(J$5-H$5))*(J48-H48))","v":0.55000000000000004},0.31,{"$f":"J48+(((K$5-J$5)/(L$5-J$5))*(L48-J48))","v":0.46999999999999992},0.27,{"$f":"L48+(((M$5-L$5)/(N$5-L$5))*(N48-L48))","v":0.47000000000000008},0.23,{"$f":"N48+(((O$5-N$5)/(P$5-N$5))*(P48-N48))","v":0.32857142857142857},0]
[{"$f":"IF((AND(A48<$B$56,A50>$B$56)),$B$56,\"0,0\")","v":"0,0"},{"$f":"B52+((($A49-$A52)/($A48-$A52))*(B48-B52))","v":1.1499999999999995},1.1499999999999995,{"$f":"D50+((($A49-$A50)/($A48-$A50))*(D48-D50))","v":0.75000000000000011},1.0500000000000003,{"$f":"F50+((($A49-$A50)/($A48-$A50))*(F48-F50))","v":0.45},0.6100000000000001,{"$f":"H50+((($A49-$A50)/($A48-$A50))*(H48-H50))","v":0.37},0.55000000000000004,{"$f":"J50+((($A49-$A50)/($A48-$A50))*(J48-J50))","v":0.31},0.46999999999999992,{"$f":"L50+((($A49-$A50)/($A48-$A50))*(L48-L50))","v":0.27},0.47000000000000008,{"$f":"N50+((($A49-$A50)/($A48-$A50))*(N48-N50))","v":0.23},0.32857142857142857,{"$f":"P52+((($A49-$A52)/($A48-$A52))*(P48-P52))","v":0}]
[34,0.81,0.81,0.57999999999999996,0.71,0.45,0.6100000000000001,0.37,0.55000000000000004,0.31,0.46999999999999992,0.27,0.47000000000000008,0.23,0.32857142857142857,0]
[{"$f":"IF((AND(A50<$B$56,A52>$B$56)),$B$56,\"0,0\")","v":"0,0"},{"$f":"B54+((($A51-$A54)/($A50-$A54))*(B50-B54))","v":0.81070393374741201},0.81070393374741201,0.75000000000000011,0.88000000000000012,0.62000000000000011,0.78,0.54000000000000015,1.2300000000000004,0.31,0.46999999999999992,0.27,0.47000000000000008,0.23,0.32857142857142857,0]
[36,0.79,0.79,0.56999999999999995,0.7,0.44,0.60000000000000009,0.36,0.51,0.31,0.46999999999999992,0.27,0.47000000000000008,0.23,0.32857142857142857,0]
[{"$f":"IF((AND(A52<$B$56,A54>$B$56)),$B$56,\"0,0\")","v":"0,0"},{"$f":"B54+((($A53-$A54)/($A36-$A54))*(B36-B54))","v":1.0655102040816327},1.0655102040816327,0.56999999999999995,0.7,0.44,0.60000000000000009,0.36,0.51,0.31,0.46999999999999992,0.27,0.47000000000000008,0.23,0.32857142857142857,0]
[1000,{"$f":"B52","v":0.79},0.79,{"$f":"D52","v":0.56999999999999995},0.7,{"$f":"F52","v":0.44},0.60000000000000009,{"$f":"H52","v":0.36},0.51,{"$f":"J52","v":0.31},0.46999999999999992,{"$f":"L52","v":0.27},0.47000000000000008,{"$f":"N52","v":0.23},0.32857142857142857,{"$f":"P52","v":0}]
[]
["B'",{"$f":"IF(Cerramiento!G3=\"ESTIMADOS\",Auxiliar!AF31,'Datos necesarios'!R28)","v":""},null,"Rf",{"$f":"'Recop. Datos'!A18","v":0},null,"Us (0,0)",{"$f":"IFERROR((INDEX(B6:P54,MATCH(B56,A6:A54,0),MATCH(E56,B5:P5,0))),0)","v":0}]

{"sheet":"Tabla9V","index":16,"n_rows":56,"n_cols":16,"rows_kept":56,"cut":false,"hidden":true,"merged":[[0,0,1,15],[2,5,3,9]]}
["Tabla 9. TRANSMITANCIA TÉRMICA Us [W/m²K]"]
[]
[null,null,null,null,null,"Rf [m²\u0097K/ W]"]
[]
["B'",0,{"$f":"IF((AND(B5<$E$56,D5>$E$56)),$E$56,\"0,00\")","v":"0,00"},0.5,{"$f":"IF((AND(D5<$E$56,F5>$E$56)),$E$56,\"0,00\")","v":"0,00"},1,{"$f":"IF((AND(F5<$E$56,H5>$E$56)),$E$56,\"0,00\")","v":"0,00"},1.5,{"$f":"IF((AND(H5<$E$56,J5>$E$56)),$E$56,\"0,00\")","v":"0,00"},2,{"$f":"IF((AND(J5<$E$56,L5>$E$56)),$E$56,\"0,00\")","v":"0,00"},2.5,{"$f":"IF((AND(L5<$E$56,N5>$E$56)),$E$56,\"0,00\")","v":"0,00"},3,{"$f":"IF((AND(N5<$E$56,P5>$E$56)),$E$56,\"0,00\")","v":"0,00"},10]
[0,{"$f":"B10+((($A$6-$A$10)/($A$8-$A$10))*(B8-B10))","v":13.410000000000002},{"$f":"B6+(((C$5-B$5)/(D$5-B$5))*(D6-B6))","v":13.410000000000002},{"$f":"D10+((($A$6-$A$10)/($A$8-$A$10))*(D8-D10))","v":1.8399999999999999},{"$f":"D6+(((E$5-D$5)/(F$5-D$5))*(F6-D6))","v":2.7199999999999998},{"$f":"F10+((($A$6-$A$10)/($A$8-$A$10))*(F8-F10))","v":0.96000000000000008},{"$f":"F6+(((G$5-F$5)/(H$5-F$5))*(H6-F6))","v":1.58},{"$f":"H10+((($A$6-$A$10)/($A$8-$A$10))*(H8-H10))","v":0.65},{"$f":"H6+(((I$5-H$5)/(J$5-H$5))*(J6-H6))","v":1.1600000000000001},{"$f":"J10+((($A$6-$A$10)/($A$8-$A$10))*(J8-J10))","v":0.47999999999999993},{"$f":"J6+(((K$5-J$5)/(L$5-J$5))*(L6-J6))","v":0.83999999999999964},{"$f":"L10+((($A$6-$A$10)/($A$8-$A$10))*(L8-L10))","v":0.39},0.84000000000000041,{"$f":"N10+((($A$6-$A$10)/($A$8-$A$10))*(N8-N10))","v":0.29999999999999993},0.42857142857142849,{"$f":"P10+((($A$6-$A$10)/($A$8-$A$10))*(P8-P10))","v":0}]
[{"$f":"IF((AND(A6<$B$56,A8>$B$56)),$B$56,\"0,0\")","v":"0,0"},{"$f":"B8+((($A7-$A8)/($A6-$A8))*(B6-B8))","v":13.410000000000002},13.410000000000002,{"$f":"D8+((($A7-$A8)/($A6-$A8))*(D6-D8))","v":1.8399999999999999},2.7199999999999998,{"$f":"F8+((($A7-$A8)/($A6-$A8))*(F6-F8))","v":0.96000000000000008},1.58,{"$f":"H8+((($A7-$A8)/($A6-$A8))*(H6-H8))","v":0.65},1.1600000000000001,{"$f":"J8+((($A7-$A8)/($A6-$A8))*(J6-J8))","v":0.47999999999999993},0.83999999999999964,{"$f":"L8+((($A7-$A8)/($A6-$A8))*(L6-L8))","v":0.39},0.84000000000000041,{"$f":"N8+((($A7-$A8)/($A6-$A8))*(N6-N8))","v":0.29999999999999993},0.42857142857142849,{"$f":"P8+((($A7-$A8)/($A6-$A8))*(P6-P8))","v":0}]
[1,9.3800000000000008,9.3800000000000008,1.65,2.4,0.9,1.46,0.62,1.07,0.47,0.82999999999999985,0.38,0.83000000000000007,0.28999999999999998,0.41428571428571426,0]
[{"$f":"IF((AND(A8<$B$56,A10>$B$56)),$B$56,\"0,0\")","v":"0,0"},{"$f":"B10+((($A9-$A10)/($A8-$A10))*(B8-B10))","v":13.410000000000002},13.410000000000002,{"$f":"D10+((($A9-$A10)/($A8-$A10))*(D8-D10))","v":1.8399999999999999},2.7199999999999998,{"$f":"F10+((($A9-$A10)/($A8-$A10))*(F8-F10))","v":0.96000000000000008},1.58,{"$f":"H10+((($A9-$A10)/($A8-$A10))*(H8-H10))","v":0.65},1.1600000000000001,{"$f":"J10+((($A9-$A10)/($A8-$A10))*(J8-J10))","v":0.47999999999999993},0.83999999999999964,{"$f":"L10+((($A9-$A10)/($A8-$A10))*(L8-L10))","v":0.39},0.84000000000000041,{"$f":"N10+((($A9-$A10)/($A8-$A10))*(N8-N10))","v":0.29999999999999993},0.42857142857142849,{"$f":"P10+((($A9-$A10)/($A8-$A10))*(P8-P10))","v":0}]
[2,5.35,5.35,1.46,2.08,0.84,1.3399999999999999,0.59,0.97999999999999976,0.46,0.82000000000000006,0.37,0.81999999999999984,0.28000000000000003,0.4,0]
[{"$f":"IF((AND(A10<$B$56,A12>$B$56)),$B$56,\"0,0\")","v":"0,0"},{"$f":"B12+((($A11-$A12)/($A10-$A12))*(B10-B12))","v":8.2899999999999991},8.2899999999999991,{"$f":"D12+((($A11-$A12)/($A10-$A12))*(D10-D12))","v":1.7399999999999998},2.5599999999999996,{"$f":"F12+((($A11-$A12)/($A10-$A12))*(F10-F12))","v":0.91999999999999982},1.4999999999999996,{"$f":"H12+((($A11-$A12)/($A10-$A12))*(H10-H12))","v":0.63},1.02,{"$f":"J12+((($A11-$A12)/($A10-$A12))*(J10-J12))","v":0.5},0.94,{"$f":"L12+((($A11-$A12)/($A10-$A12))*(L10-L12))","v":0.39},0.94,0.28000000000000003,0.4,{"$f":"P12+((($A11-$A12)/($A10-$A12))*(P10-P12))","v":0}]
[3,3.88,3.88,1.32,1.84,0.8,1.2600000000000002,0.56999999999999995,0.95999999999999974,0.44,0.76,0.36,0.75999999999999979,0.28000000000000003,0.4,0]
[{"$f":"IF((AND(A12<$B$56,A14>$B$56)),$B$56,\"0,0\")","v":"0,0"},{"$f":"B14+((($A13-$A14)/($A12-$A14))*(B12-B14))","v":6.1899999999999995},6.1899999999999995,{"$f":"D14+((($A13-$A14)/($A12-$A14))*(D12-D14))","v":1.6800000000000004},2.4400000000000004,{"$f":"F14+((($A13-$A14)/($A12-$A14))*(F12-F14))","v":0.92000000000000015},1.5000000000000011,{"$f":"H14+((($A13-$A14)/($A12-$A14))*(H12-H14))","v":0.62999999999999967},1.1099999999999985,{"$f":"J14+((($A13-$A14)/($A12-$A14))*(J12-J14))","v":0.47000000000000003},0.79,{"$f":"L14+((($A13-$A14)/($A12-$A14))*(L12-L14))","v":0.39},0.78999999999999981,0.31000000000000005,0.44285714285714295,{"$f":"P14+((($A13-$A14)/($A12-$A14))*(P12-P14))","v":0}]
[4,3.11,3.11,1.2,1.64,0.76,1.18,0.55000000000000004,0.91000000000000014,0.43,0.75,0.35,0.74999999999999978,0.27,0.38571428571428573,0]
[{"$f":"IF((AND(A14<$B$56,A16>$B$56)),$B$56,\"0,0\")","v":"0,0"},{"$f":"B16+((($A15-$A16)/($A14-$A16))*(B14-B16))","v":5.0299999999999994},5.0299999999999994,{"$f":"D16+((($A15-$A16)/($A14-$A16))*(D14-D16))","v":1.4400000000000002},1.9600000000000002,{"$f":"F16+((($A15-$A16)/($A14-$A16))*(F14-F16))","v":0.92000000000000015},1.5000000000000002,{"$f":"H16+((($A15-$A16)/($A14-$A16))*(H14-H16))","v":0.63000000000000012},1.1100000000000003,{"$f":"J16+((($A15-$A16)/($A14-$A16))*(J14-J16))","v":0.47000000000000003},0.95000000000000018,{"$f":"L16+((($A15-$A16)/($A14-$A16))*(L14-L16))","v":0.35},0.74999999999999978,0.27,0.38571428571428573,{"$f":"P16+((($A15-$A16)/($A14-$A16))*(P14-P16))","v":0}]
[5,2.63,2.63,1.1399999999999999,1.5599999999999998,0.72,1.0999999999999999,0.53,0.8600000000000001,0.42,0.7,0.35,0.74999999999999978,0.27,0.38571428571428573,0]
[{"$f":"IF((AND(A16<$B$56,A18>$B$56)),$B$56,\"0,0\")","v":"0,0"},{"$f":"B18+((($A17-$A18)/($A16-$A18))*(B16-B18))","v":4.28},4.28,{"$f":"D18+((($A17-$A18)/($A16-$A18))*(D16-D18))","v":1.4899999999999991},2.1599999999999984,{"$f":"F18+((($A17-$A18)/($A16-$A18))*(F16-F18))","v":0.82000000000000006},1.3,{"$f":"H18+((($A17-$A18)/($A16-$A18))*(H16-H18))","v":0.58000000000000007},0.91000000000000014,{"$f":"J18+((($A17-$A18)/($A16-$A18))*(J16-J18))","v":0.47000000000000003},0.75000000000000111,{"$f":"L18+((($A17-$A18)/($A16-$A18))*(L16-L18))","v":0.39999999999999974},1.0499999999999983,0.27,0.38571428571428573,{"$f":"P18+((($A17-$A18)/($A16-$A18))*(P16-P18))","v":0}]
[6,2.2999999999999998,2.2999999999999998,1.07,1.4400000000000002,0.7,1.0599999999999998,0.52,0.85000000000000009,0.41,0.68999999999999972,0.34,0.69000000000000006,0.27,0.38571428571428573,0]
[{"$f":"IF((AND(A18<$B$56,A20>$B$56)),$B$56,\"0,0\")","v":"0,0"},{"$f":"B20+((($A19-$A20)/($A18-$A20))*(B18-B20))","v":3.7399999999999984},3.7399999999999984,{"$f":"D20+((($A19-$A20)/($A18-$A20))*(D18-D20))","v":1.4300000000000004},1.9800000000000013,{"$f":"F20+((($A19-$A20)/($A18-$A20))*(F18-F20))","v":0.87999999999999945},1.3599999999999981,{"$f":"H20+((($A19-$A20)/($A18-$A20))*(H18-H20))","v":0.64000000000000012},1.1500000000000015,{"$f":"J20+((($A19-$A20)/($A18-$A20))*(J18-J20))","v":0.4699999999999997},0.74999999999999822,{"$f":"L20+((($A19-$A20)/($A18-$A20))*(L18-L20))","v":0.40000000000000008},0.75000000000000011,0.33000000000000007,0.47142857142857153,{"$f":"P20+((($A19-$A20)/($A18-$A20))*(P18-P20))","v":0}]
[7,2.06,2.06,1.01,1.35,0.67,1.0100000000000002,0.5,0.79999999999999993,0.4,0.68,0.33,0.68,0.26,0.37142857142857144,0]
[{"$f":"IF((AND(A20<$B$56,A22>$B$56)),$B$56,\"0,0\")","v":"0,0"},{"$f":"B22+((($A21-$A22)/($A20-$A22))*(B20-B22))","v":3.3899999999999997},3.3899999999999997,{"$f":"D22+((($A21-$A22)/($A20-$A22))*(D20-D22))","v":1.2900000000000003},1.7700000000000005,{"$f":"F22+((($A21-$A22)/($A20-$A22))*(F20-F22))","v":0.81000000000000016},1.2900000000000005,{"$f":"H22+((($A21-$A22)/($A20-$A22))*(H20-H22))","v":0.57000000000000006},0.87,{"$f":"J22+((($A21-$A22)/($A20-$A22))*(J20-J22))","v":0.47000000000000008},1.0300000000000002,{"$f":"L22+((($A21-$A22)/($A20-$A22))*(L20-L22))","v":0.33},0.68,0.26,0.37142857142857144,{"$f":"P22+((($A21-$A22)/($A20-$A22))*(P20-P22))","v":0}]
[8,1.87,1.87,0.97,1.29,0.65,0.97000000000000008,0.49,0.78999999999999992,0.39,0.63,0.33,0.68,0.26,0.37142857142857144,0]
[{"$f":"IF((AND(A22<$B$56,A24>$B$56)),$B$56,\"0,0\")","v":"0,0"},{"$f":"B24+((($A23-$A24)/($A22-$A24))*(B22-B24))","v":2.9900000000000011},2.9900000000000011,{"$f":"D24+((($A23-$A24)/($A22-$A24))*(D22-D24))","v":1.2899999999999994},1.7699999999999987,{"$f":"F24+((($A23-$A24)/($A22-$A24))*(F22-F24))","v":0.81000000000000016},1.2900000000000005,{"$f":"H24+((($A23-$A24)/($A22-$A24))*(H22-H24))","v":0.57000000000000006},1.1100000000000003,{"$f":"J24+((($A23-$A24)/($A22-$A24))*(J22-J24))","v":0.39},0.30999999999999972,{"$f":"L24+((($A23-$A24)/($A22-$A24))*(L22-L24))","v":0.41000000000000009},1.1600000000000006,0.26,0.37142857142857144,{"$f":"P24+((($A23-$A24)/($A22-$A24))*(P22-P24))","v":0}]
[9,1.73,1.73,0.93,1.23,0.63,0.93,0.48,0.74999999999999989,0.39,0.67,0.32,0.62,0.26,0.37142857142857144,0]
[{"$f":"IF((AND(A24<$B$56,A26>$B$56)),$B$56,\"0,0\")","v":"0,0"},{"$f":"B26+((($A25-$A26)/($A24-$A26))*(B24-B26))","v":2.8099999999999987},2.8099999999999987,{"$f":"D26+((($A25-$A26)/($A24-$A26))*(D24-D26))","v":1.2900000000000005},1.8600000000000008,{"$f":"F26+((($A25-$A26)/($A24-$A26))*(F24-F26))","v":0.72000000000000008},1.02,{"$f":"H26+((($A25-$A26)/($A24-$A26))*(H24-H26))","v":0.57000000000000006},0.84,{"$f":"J26+((($A25-$A26)/($A24-$A26))*(J24-J26))","v":0.48000000000000009},1.1200000000000006,{"$f":"L26+((($A25-$A26)/($A24-$A26))*(L24-L26))","v":0.32},0.62,0.26,0.37142857142857144,{"$f":"P26+((($A25-$A26)/($A24-$A26))*(P24-P26))","v":0}]
[10,1.61,1.61,0.89,1.1600000000000001,0.62,0.92,0.47,0.73999999999999988,0.38,0.62,0.32,0.62,0.26,0.37142857142857144,0]
[{"$f":"IF((AND(A26<$B$56,A28>$B$56)),$B$56,\"0,0\")","v":"0,0"},{"$f":"B28+((($A27-$A28)/($A26-$A28))*(B26-B28))","v":2.5100000000000007},2.5100000000000007,{"$f":"D28+((($A27-$A28)/($A26-$A28))*(D26-D28))","v":1.1900000000000004},1.6100000000000008,{"$f":"F28+((($A27-$A28)/($A26-$A28))*(F26-F28))","v":0.77000000000000013},1.1700000000000008,{"$f":"H28+((($A27-$A28)/($A26-$A28))*(H26-H28))","v":0.56999999999999984},0.98999999999999921,{"$f":"J28+((($A27-$A28)/($A26-$A28))*(J26-J28))","v":0.43000000000000005},0.67,{"$f":"L28+((($A27-$A28)/($A26-$A28))*(L26-L28))","v":0.37000000000000005},0.67,0.31000000000000005,0.44285714285714295,{"$f":"P28+((($A27-$A28)/($A26-$A28))*(P26-P28))","v":0}]
[12,1.43,1.43,0.83,1.0699999999999998,0.59,0.86999999999999988,0.45,0.69000000000000006,0.37,0.61,0.31,0.61,0.25,0.35714285714285715,0]
[{"$f":"IF((AND(A28<$B$56,A30>$B$56)),$B$56,\"0,0\")","v":"0,0"},{"$f":"B30+((($A29-$A30)/($A28-$A30))*(B28-B30))","v":2.2099999999999991},2.2099999999999991,{"$f":"D30+((($A29-$A30)/($A28-$A30))*(D28-D30))","v":1.0699999999999994},1.4299999999999988,{"$f":"F30+((($A29-$A30)/($A28-$A30))*(F28-F30))","v":0.71000000000000008},1.1100000000000003,{"$f":"H30+((($A29-$A30)/($A28-$A30))*(H28-H30))","v":0.51},0.74999999999999989,{"$f":"J30+((($A29-$A30)/($A28-$A30))*(J28-J30))","v":0.43000000000000005},0.91000000000000025,{"$f":"L30+((($A29-$A30)/($A28-$A30))*(L28-L30))","v":0.31},0.61,0.25,0.35714285714285715,{"$f":"P30+((($A29-$A30)/($A28-$A30))*(P28-P30))","v":0}]
[14,1.3,1.3,0.79,1.0100000000000002,0.56999999999999995,0.82999999999999985,0.44,0.68,0.36,0.55999999999999994,0.31,0.61,0.25,0.35714285714285715,0]
[{"$f":"IF((AND(A30<$B$56,A32>$B$56)),$B$56,\"0,0\")","v":"0,0"},{"$f":"B32+((($A31-$A32)/($A30-$A32))*(B30-B32))","v":2.0000000000000009},2.0000000000000009,{"$f":"D32+((($A31-$A32)/($A30-$A32))*(D30-D32))","v":1.0700000000000003},1.4300000000000013,{"$f":"F32+((($A31-$A32)/($A30-$A32))*(F30-F32))","v":0.7099999999999993},1.1099999999999979,{"$f":"H32+((($A31-$A32)/($A30-$A32))*(H30-H32))","v":0.51},0.74999999999999989,{"$f":"J32+((($A31-$A32)/($A30-$A32))*(J30-J32))","v":0.43000000000000005},0.63,{"$f":"L32+((($A31-$A32)/($A30-$A32))*(L30-L32))","v":0.38000000000000006},1.0300000000000005,0.25,0.35714285714285715,{"$f":"P32+((($A31-$A32)/($A30-$A32))*(P30-P32))","v":0}]
[16,1.2,1.2,0.75,0.95,0.55000000000000004,0.79000000000000015,0.43,0.67,0.35,0.54999999999999993,0.3,0.54999999999999993,0.25,0.35714285714285715,0]
[{"$f":"IF((AND(A32<$B$56,A34>$B$56)),$B$56,\"0,0\")","v":"0,0"},{"$f":"B34+((($A33-$A34)/($A32-$A34))*(B32-B34))","v":1.8399999999999987},1.8399999999999987,{"$f":"D34+((($A33-$A34)/($A32-$A34))*(D32-D34))","v":0.99000000000000021},1.2700000000000002,{"$f":"F34+((($A33-$A34)/($A32-$A34))*(F32-F34))","v":0.71000000000000019},1.1100000000000005,{"$f":"H34+((($A33-$A34)/($A32-$A34))*(H32-H34))","v":0.51},0.9900000000000001,{"$f":"J34+((($A33-$A34)/($A32-$A34))*(J32-J34))","v":0.35},0.22999999999999965,{"$f":"L34+((($A33-$A34)/($A32-$A34))*(L32-L34))","v":0.38000000000000006},1.0300000000000005,0.25,0.35714285714285715,{"$f":"P34+((($A33-$A34)/($A32-$A34))*(P32-P34))","v":0}]
[18,1.1200000000000001,1.1200000000000001,0.72,0.90999999999999992,0.53,0.75000000000000011,0.42,0.63,0.35,0.59,0.28999999999999998,0.48999999999999988,0.25,0.35714285714285715,0]
[{"$f":"IF((AND(A34<$B$56,A36>$B$56)),$B$56,\"0,0\")","v":"0,0"},{"$f":"B36+((($A35-$A36)/($A34-$A36))*(B34-B36))","v":1.6600000000000006},1.6600000000000006,{"$f":"D36+((($A35-$A36)/($A34-$A36))*(D34-D36))","v":0.99000000000000021},1.2700000000000002,{"$f":"F36+((($A35-$A36)/($A34-$A36))*(F34-F36))","v":0.71000000000000019},1.1100000000000005,{"$f":"H36+((($A35-$A36)/($A34-$A36))*(H34-H36))","v":0.51},0.72000000000000131,{"$f":"J36+((($A35-$A36)/($A34-$A36))*(J34-J36))","v":0.43999999999999956},1.0399999999999978,{"$f":"L36+((($A35-$A36)/($A34-$A36))*(L34-L36))","v":0.28999999999999998},0.48999999999999988,0.25,0.35714285714285715,{"$f":"P36+((($A35-$A36)/($A34-$A36))*(P34-P36))","v":0}]
[20,1.06,1.06,0.69,0.86999999999999988,0.51,0.71000000000000008,0.41,0.61999999999999988,0.34,0.54000000000000026,0.28999999999999998,0.48999999999999988,0.25,0.35714285714285715,0]
[{"$f":"IF((AND(A36<$B$56,A38>$B$56)),$B$56,\"0,0\")","v":"0,0"},{"$f":"B38+((($A37-$A38)/($A36-$A38))*(B36-B38))","v":1.6600000000000006},1.6600000000000006,{"$f":"D38+((($A37-$A38)/($A36-$A38))*(D36-D38))","v":0.88999999999999901},1.1699999999999979,{"$f":"F38+((($A37-$A38)/($A36-$A38))*(F36-F38))","v":0.6100000000000001},0.81000000000000116,{"$f":"H38+((($A37-$A38)/($A36-$A38))*(H36-H38))","v":0.50999999999999956},0.71999999999999797,{"$f":"J38+((($A37-$A38)/($A36-$A38))*(J36-J38))","v":0.44000000000000011},1.0400000000000007,{"$f":"L38+((($A37-$A38)/($A36-$A38))*(L36-L38))","v":0.28999999999999998},0.48999999999999988,0.25,0.35714285714285715,{"$f":"P38+((($A37-$A38)/($A36-$A38))*(P36-P38))","v":0}]
[22,1,1,0.67,0.84000000000000008,0.5,0.7,0.4,0.6100000000000001,0.33,0.49000000000000016,0.28999999999999998,0.48999999999999988,0.25,0.35714285714285715,0]
[{"$f":"IF((AND(A38<$B$56,A40>$B$56)),$B$56,\"0,0\")","v":"0,0"},1.4400000000000004,1.4400000000000004,0.89000000000000024,1.1700000000000004,0.6100000000000001,0.81,0.51000000000000012,1.0500000000000003,0.33,5.0000000000002209E-2,0.39999999999999947,0.59999999999999631,0.3600000000000001,0.51428571428571446,0]
[24,0.96,0.96,0.65,0.81,0.49,0.69,0.39,0.57000000000000006,0.33,0.53,0.28000000000000003,0.4800000000000002,0.24,0.34285714285714286,0]
[{"$f":"IF((AND(A40<$B$56,A42>$B$56)),$B$56,\"0,0\")","v":"0,0"},1.4399999999999991,1.4399999999999991,0.89000000000000024,1.1700000000000004,0.6100000000000001,1.0500000000000003,0.39,0.20999999999999969,0.45000000000000012,1.1300000000000006,0.28000000000000003,0.4800000000000002,0.24,0.34285714285714286,0]
[26,0.92,0.92,0.63,0.78,0.48,0.65999999999999992,0.39,0.60000000000000009,0.32,0.47999999999999993,0.28000000000000003,0.4800000000000002,0.24,0.34285714285714286,0]
[{"$f":"IF((AND(A42<$B$56,A44>$B$56)),$B$56,\"0,0\")","v":"0,0"},1.3100000000000005,1.3100000000000005,0.89000000000000024,1.1700000000000004,0.6100000000000001,0.79,0.52000000000000013,1.1200000000000006,0.32,0.47999999999999993,0.28000000000000003,0.4800000000000002,0.24,0.34285714285714286,0]
[28,0.89,0.89,0.61,0.75,0.47,0.64999999999999991,0.38,0.56000000000000005,0.32,0.47999999999999993,0.28000000000000003,0.4800000000000002,0.24,0.34285714285714286,0]
[{"$f":"IF((AND(A44<$B$56,A46>$B$56)),$B$56,\"0,0\")","v":"0,0"},1.3100000000000005,1.3100000000000005,0.75000000000000011,0.8900000000000009,0.60999999999999932,1.0699999999999981,0.38,0.56000000000000005,0.32,-8.0000000000000571E-2,0.42000000000000015,1.320000000000001,0.24,0.34285714285714286,0]
[30,0.86,0.86,0.6,0.74,0.46,0.62000000000000011,0.38,0.56000000000000005,0.32,0.52,0.27,0.42000000000000015,0.24,0.34285714285714286,0]
[{"$f":"IF((AND(A46<$B$56,A48>$B$56)),$B$56,\"0,0\")","v":"0,0"},1.3100000000000005,1.3100000000000005,0.75000000000000011,0.89000000000000012,0.6100000000000001,0.77,0.53000000000000014,0.71000000000000019,0.47000000000000014,1.2700000000000007,0.27,-0.32999999999999829,0.38999999999999968,0.55714285714285672,0]
[32,0.83,0.83,0.59,0.73,0.45,0.6100000000000001,0.37,0.55000000000000004,0.31,0.46999999999999992,0.27,0.47000000000000008,0.23,0.32857142857142857,0]
[{"$f":"IF((AND(A48<$B$56,A50>$B$56)),$B$56,\"0,0\")","v":"0,0"},{"$f":"B52+((($A49-$A52)/($A48-$A52))*(B48-B52))","v":1.1499999999999995},1.1499999999999995,{"$f":"D50+((($A49-$A50)/($A48-$A50))*(D48-D50))","v":0.75000000000000011},1.0500000000000003,{"$f":"F50+((($A49-$A50)/($A48-$A50))*(F48-F50))","v":0.45},0.6100000000000001,{"$f":"H50+((($A49-$A50)/($A48-$A50))*(H48-H50))","v":0.37},0.55000000000000004,{"$f":"J50+((($A49-$A50)/($A48-$A50))*(J48-J50))","v":0.31},0.46999999999999992,{"$f":"L50+((($A49-$A50)/($A48-$A50))*(L48-L50))","v":0.27},0.47000000000000008,{"$f":"N50+((($A49-$A50)/($A48-$A50))*(N48-N50))","v":0.23},0.32857142857142857,{"$f":"P52+((($A49-$A52)/($A48-$A52))*(P48-P52))","v":0}]
[34,0.81,0.81,0.57999999999999996,0.71,0.45,0.6100000000000001,0.37,0.55000000000000004,0.31,0.46999999999999992,0.27,0.47000000000000008,0.23,0.32857142857142857,0]
[{"$f":"IF((AND(A50<$B$56,A52>$B$56)),$B$56,\"0,0\")","v":"0,0"},{"$f":"B54+((($A51-$A54)/($A50-$A54))*(B50-B54))","v":0.81070393374741201},0.81070393374741201,0.75000000000000011,0.88000000000000012,0.62000000000000011,0.78,0.54000000000000015,1.2300000000000004,0.31,0.46999999999999992,0.27,0.47000000000000008,0.23,0.32857142857142857,0]
[36,0.79,0.79,0.56999999999999995,0.7,0.44,0.60000000000000009,0.36,0.51,0.31,0.46999999999999992,0.27,0.47000000000000008,0.23,0.32857142857142857,0]
[{"$f":"IF((AND(A52<$B$56,A54>$B$56)),$B$56,\"0,0\")","v":"0,0"},{"$f":"B54+((($A53-$A54)/($A36-$A54))*(B36-B54))","v":1.0655102040816327},1.0655102040816327,0.56999999999999995,0.7,0.44,0.60000000000000009,0.36,0.51,0.31,0.46999999999999992,0.27,0.47000000000000008,0.23,0.32857142857142857,0]
[1000,{"$f":"B52","v":0.79},0.79,{"$f":"D52","v":0.56999999999999995},0.7,{"$f":"F52","v":0.44},0.60000000000000009,{"$f":"H52","v":0.36},0.51,{"$f":"J52","v":0.31},0.46999999999999992,{"$f":"L52","v":0.27},0.47000000000000008,{"$f":"N52","v":0.23},0.32857142857142857,{"$f":"P52","v":0}]
[]
["B'",{"$f":"IF(Cerramiento!G3=\"ESTIMADOS\",Auxiliar!AF31,'Datos necesarios'!R28)","v":""},null,"Rf",{"$f":"'Recop. Datos'!G18","v":0},null,"Us (0,0)",{"$f":"IFERROR((INDEX(B6:P54,MATCH(B56,A6:A54,0),MATCH(E56,B5:P5,0))),0)","v":0}]